program: Orca
programVersion: 5.0.4
elementType: F Si C C C C C C O H H H H H
charge: 0
multiplicity: 1
keywords: Opt RIJCOSX PBEh-3c
formula: C6H5FOSi
InChI: InChI=1/C6H5FOSi/c7-9(8)6-4-2-1-3-5-6/h1-5H
14 atoms
F  3.163795 1.431408 -0.091208
Si 2.597721 -0.056065 -0.24764
C  0.778345 0.00936 -0.0689
C  0.084503 -1.204207 -0.053939
C  -1.294234 -1.217076 0.075188
C  -1.989656 -0.02061 0.179379
C  -1.310476 1.189946 0.16066
C  0.069457 1.2074 0.041879
O  3.435875 -1.289741 -0.494543
H  0.627402 -2.136851 -0.141631
H  -1.826939 -2.158353 0.093024
H  -3.067499 -0.031226 0.275858
H  -1.857756 2.119622 0.239661
H  0.589361 2.156394 0.032413
totalener: -695.07384229 hartree
nucrepener: 476.22984146 hartree
electener: -1171.30368374 hartree
oneelecener: -1901.32531997 hartree
twoeener: 730.02163622 hartree
kineticenergy: 691.53561058 hartree
exchangeener: -40.044612696666 hartree
correlationener: -3.277691181033 hartree
xcener: -43.322303877699 hartree
dispersion: -0.008310426 hartree
dispersion: -0.008310772 hartree
dispersion: -0.008310951 hartree
dispersion: -0.008311044 hartree
dispersion: -0.008310993 hartree
dispersion: -0.008311058 hartree
energy: -1818.1147 -683.4182 -529.2478 -285.2530 -285.1945 -285.1601 -285.1531 -285.0035 -284.9792 -151.8803 -105.5150 -105.3885 -105.2778 -36.2250 -27.7384 -26.8021 -23.5976 -23.5811 -19.3178 -19.3027 -17.1723 -16.4272 -14.8762 -14.7992 -14.5143 -14.4637 -13.8669 -13.4375 -12.3829 -11.8496 -11.5720 -10.6099 -9.8758 -9.3783 -8.8639 -8.7580 -1.3410 -0.1962 0.4149 1.3431 3.6107 3.7387 4.6557 4.9089 5.2751 5.7895 6.3182 6.7547 6.9983 7.9387 8.3145 8.6426 9.0731 11.3473 12.4391 12.5946 13.5567 13.8433 14.4069 14.6204 14.8555 15.7893 16.0241 16.3462 16.5005 16.5358 16.6450 17.1449 17.8286 18.4407 18.5283 19.6069 20.3688 20.6720 22.4150 24.5373 24.9834 25.2653 25.5718 25.9775 26.5395 27.1512 27.7753 27.9933 28.8091 29.0683 29.4345 30.4155 30.7997 31.9950 32.4924 33.2151 33.6538 34.2870 34.5422 34.7039 34.8394 35.4899 36.8662 37.2929 39.0834 40.5564 41.3350 41.5080 41.8290 42.1706 43.0945 43.9250 44.4473 49.0531 49.9703 51.0392 52.6816 53.1273 54.5892 54.8083 55.7107 57.5623 58.3226 58.4961 59.0606 59.3192 59.7192 59.8906 63.3703 63.8422 63.9814 64.1182 69.4707 71.0250 73.5211 73.7443 74.5081 74.7068 75.5785 76.6085 77.6500 81.3483 83.4270 93.2943 359.8944 370.7344 371.2152 383.2285 383.9000 395.0873 695.1777 891.6437 electronvolt
chargesum: -0.0000000
charge: -0.455283 1.156417 -0.203654 -0.250580 -0.204589 -0.217890 -0.202722 -0.264246 -0.579492 0.265793 0.236252 0.237488 0.234745 0.247760
charge: -0.222731 0.680235 -0.220151 -0.095543 -0.131254 -0.103072 -0.132523 -0.104335 -0.408900 0.158232 0.144288 0.143458 0.143286 0.149010
qa: -0.4553 1.1564 -0.2037 -0.2506 -0.2046 -0.2179 -0.2027 -0.2642 -0.5795 0.2658 0.2363 0.2375 0.2347 0.2478
va: 0.9915 4.0081 3.6979 3.8026 3.7939 3.8092 3.7996 3.8140 2.1571 0.8976 0.9058 0.9050 0.9062 0.9055
dispersion: -0.008311077 hartree
energy: -695.064003603911 hartree
dipole: -11.89828 10.03889 -1.85939 -1.50921 2.20273 0.69352 0.88054 -0.61507 0.26547
magnitude: 2.00220 au
magnitude: 5.08918 debye
