program: Orca
programVersion: 5.0.4
elementType: F Si C C C C C C H H H H H
charge: 2
multiplicity: 1
keywords: Freq RIJCOSX PBEh-3c
frequency: 0.00 0.00 0.00 0.00 0.00 0.00 62.92 76.86 80.88 299.76 358.35 363.50 368.03 594.45 599.16 697.91 745.78 823.17 960.40 987.46 1012.91 1034.63 1053.17 1061.48 1151.64 1177.56 1244.08 1266.27 1364.90 1418.47 1507.03 1517.05 1616.75 1632.57 3271.00 3277.00 3283.44 3287.97 3292.90
frequency: 62.92 76.86 80.88 299.76 358.35 363.50 368.03 594.45 599.16 697.91 745.78 823.17 960.40 987.46 1012.91 1034.63 1053.17 1061.48 1151.64 1177.56 1244.08 1266.27 1364.90 1418.47 1507.03 1517.05 1616.75 1632.57 3271.00 3277.00 3283.44 3287.97 3292.90
formula: C6H5FSi
InChI: InChI=1/C6H5FSi/c7-8-6-4-2-1-3-5-6/h1-5H
13 atoms
F  3.902604 -0.623781 -1.529569
Si 2.482174 -0.430779 -0.980368
C  0.866735 -0.167337 -0.351221
C  -0.031219 -1.272452 -0.280812
C  -1.279379 -1.008779 0.226302
C  -1.620925 0.284381 0.64461
C  -0.717216 1.351928 0.56428
C  0.547969 1.159524 0.067586
H  0.227179 -2.273906 -0.602206
H  -1.998401 -1.815598 0.29928
H  -2.613561 0.464124 1.041037
H  -1.007242 2.342423 0.893048
H  1.241182 1.990151 0.008133
totalener: -619.09185710 hartree
nucrepener: 378.86431099 hartree
electener: -997.95616809 hartree
oneelecener: -1576.50470211 hartree
twoeener: 578.54853402 hartree
kineticenergy: 616.09261099 hartree
exchangeener: -35.050361535342 hartree
correlationener: -2.812954093700 hartree
xcener: -37.863315629042 hartree
energy: -1832.8838 -696.3462 -297.0002 -295.4280 -295.3905 -294.6803 -294.1776 -294.1710 -166.4571 -120.0682 -119.9641 -119.8031 -49.0530 -36.7397 -33.5135 -33.3427 -29.7546 -28.8804 -28.6752 -26.8162 -26.8131 -26.6155 -24.6395 -24.6003 -23.5014 -23.2369 -22.2208 -20.9874 -20.9334 -18.7815 -18.1982 -14.0556 -13.4291 -13.1633 -9.6565 -9.3033 -5.0672 -4.8602 -4.4705 -4.0055 -3.8946 -3.1744 -2.9512 -2.3177 -1.6666 -1.3796 -0.4076 -0.0745 -0.0628 0.3614 0.9144 1.7407 2.3612 2.8882 4.6210 4.7791 5.2651 5.9476 6.4095 6.4817 6.9219 7.3265 7.5629 7.7268 8.6674 8.7837 8.9448 10.7713 11.5553 12.2116 12.6577 15.3635 16.4083 16.7033 17.1985 17.7492 18.3361 18.4485 18.8900 19.5926 20.5057 20.7212 22.2246 22.5563 22.9000 23.2089 23.2603 24.0234 24.2146 24.8979 26.2827 26.3587 28.1043 30.4463 30.6022 31.7979 31.9159 32.3431 32.8386 34.1630 37.2200 39.2870 39.3951 41.9661 44.9306 45.5946 47.4385 48.2081 48.8279 49.1932 49.7991 50.2675 53.2959 53.4439 54.9691 59.2246 61.1694 62.8884 63.2877 63.4556 66.0597 66.3064 66.9013 72.9024 74.2682 82.6011 350.2614 360.4478 361.0315 371.8730 374.2534 384.5125 883.0337 electronvolt
chargesum: 2.0000000
charge: -0.262923 1.557835 -0.158297 -0.185975 -0.199515 -0.122982 -0.199338 -0.193291 0.336267 0.363129 0.366630 0.363064 0.335397
charge: -0.042654 1.383830 -0.205572 -0.039690 -0.062995 0.051622 -0.063824 -0.041693 0.197634 0.208724 0.208603 0.208919 0.197097
qa: -0.2629 1.5578 -0.1583 -0.1860 -0.1995 -0.1230 -0.1993 -0.1933 0.3363 0.3631 0.3666 0.3631 0.3354
va: 1.2632 2.8390 3.6064 3.7084 3.7456 3.6195 3.7505 3.7126 0.8581 0.8453 0.8414 0.8453 0.8584
dispersion: -0.007527026 hartree
energy: -619.084633488054 hartree
dipole: -11.02002 11.55465 0.53463 1.83512 -1.96329 -0.12817 4.33889 -4.55470 -0.21580
magnitude: 0.59061 au
magnitude: 1.50122 debye
temp: 298.15 k
press: 1.00 atm
zeropoint: 0.09451993 hartree
thermalvibcorrection: 0.00472958 hartree
thermalrotcorrection: 0.00141627 hartree
thermaltrasncorrection: 0.00141627 hartree
thermaltotal: -618.98255143 hartree
thermalcorr: 0.00756212 hartree
nonthermalcorr: 0.09451993 hartree
totalcorr: 0.10208205 hartree
thermalcorrenthalpy: 0.00094421 hartree
totalenthalpy: -618.98160723 hartree
vibrat: 0.00821270 hartree
rotat: 0.01363351 hartree
transl: 0.01917807 hartree
total: 0.04102429 hartree
totalentropycorr: -0.04102429 hartree
gibbsenthalpy: -619.02263151 hartree
gibbsminuselec: 0.06200198 hartree
