program: Orca
programVersion: 5.0.4
elementType: F Si C C C C C C H H H H H
charge: 2
multiplicity: 1
keywords: Opt RIJCOSX PBEh-3c
formula: C6H5FSi
InChI: InChI=1/C6H5FSi/c7-8-6-4-2-1-3-5-6/h1-5H
13 atoms
F  3.902604 -0.623781 -1.529569
Si 2.482174 -0.430779 -0.980368
C  0.866735 -0.167337 -0.351221
C  -0.031219 -1.272452 -0.280812
C  -1.279379 -1.008779 0.226302
C  -1.620925 0.284381 0.64461
C  -0.717216 1.351928 0.56428
C  0.547969 1.159524 0.067586
H  0.227179 -2.273906 -0.602206
H  -1.998401 -1.815598 0.29928
H  -2.613561 0.464124 1.041037
H  -1.007242 2.342423 0.893048
H  1.241182 1.990151 0.008133
totalener: -619.09185377 hartree
nucrepener: 378.81894114 hartree
electener: -997.91079491 hartree
oneelecener: -1576.41520126 hartree
twoeener: 578.50440635 hartree
kineticenergy: 616.08941347 hartree
exchangeener: -35.049793393609 hartree
correlationener: -2.812901947900 hartree
xcener: -37.862695341509 hartree
dispersion: -0.007526394 hartree
dispersion: -0.007526780 hartree
dispersion: -0.007527167 hartree
dispersion: -0.007527101 hartree
energy: -1832.8832 -696.3492 -297.0034 -295.4305 -295.3928 -294.6749 -294.1766 -294.1704 -166.4568 -120.0679 -119.9638 -119.8027 -49.0542 -36.7404 -33.5131 -33.3434 -29.7549 -28.8806 -28.6759 -26.8173 -26.8142 -26.6162 -24.6396 -24.6005 -23.5019 -23.2364 -22.2216 -20.9868 -20.9329 -18.7809 -18.1987 -14.0563 -13.4295 -13.1634 -9.6567 -9.3034 -5.0677 -4.8599 -4.4710 -4.0060 -3.8950 -3.1741 -2.9516 -2.3178 -1.6666 -1.3789 -0.4076 -0.0747 -0.0625 0.3612 0.9145 1.7403 2.3612 2.8876 4.6207 4.7792 5.2647 5.9468 6.4089 6.4811 6.9216 7.3276 7.5635 7.7279 8.6674 8.7837 8.9442 10.7716 11.5550 12.2108 12.6568 15.3634 16.4076 16.7028 17.1987 17.7494 18.3364 18.4484 18.8902 19.5928 20.5061 20.7215 22.2247 22.5558 22.8994 23.2080 23.2595 24.0226 24.2139 24.8975 26.2826 26.3586 28.1035 30.4464 30.6018 31.7972 31.9171 32.3434 32.8385 34.1622 37.2189 39.2866 39.3949 41.9658 44.9301 45.5951 47.4388 48.2075 48.8274 49.1937 49.7987 50.2673 53.2956 53.4443 54.9687 59.2245 61.1691 62.8883 63.2877 63.4558 66.0594 66.3063 66.9014 72.9025 74.2674 82.6012 350.2614 360.4470 361.0317 371.8729 374.2527 384.5128 883.0311 electronvolt
chargesum: 2.0000000
charge: -0.262863 1.557691 -0.158163 -0.185861 -0.199508 -0.123300 -0.199362 -0.193158 0.336253 0.363132 0.366682 0.363073 0.335382
charge: -0.042605 1.383712 -0.205465 -0.039590 -0.063008 0.051395 -0.063859 -0.041578 0.197625 0.208726 0.208635 0.208924 0.197088
qa: -0.2629 1.5577 -0.1582 -0.1859 -0.1995 -0.1233 -0.1994 -0.1932 0.3363 0.3631 0.3667 0.3631 0.3354
va: 1.2633 2.8391 3.6065 3.7084 3.7456 3.6195 3.7505 3.7126 0.8581 0.8453 0.8414 0.8453 0.8584
dispersion: -0.007527026 hartree
energy: -619.084633514248 hartree
dipole: -11.02002 11.55537 0.53534 1.83512 -1.96341 -0.12829 4.33889 -4.55498 -0.21608
magnitude: 0.59139 au
magnitude: 1.50320 debye
