program: Orca
programVersion: 5.0.4
elementType: F Si C F F F C C C C C C H H H H H
charge: 1
multiplicity: 1
keywords: Freq RIJCOSX PBEh-3c
frequency: 0.00 0.00 0.00 0.00 0.00 0.00 17.26 54.86 81.85 101.88 148.91 163.25 245.61 254.60 333.20 365.50 400.15 447.28 517.37 522.72 537.28 629.54 699.47 736.19 790.29 795.30 893.60 1008.35 1026.34 1036.95 1052.27 1078.43 1082.37 1156.14 1182.55 1236.08 1237.35 1265.70 1285.78 1292.70 1377.22 1431.94 1516.49 1561.85 1666.23 1694.83 3277.80 3287.15 3291.91 3304.34 3308.56
frequency: 17.26 54.86 81.85 101.88 148.91 163.25 245.61 254.60 333.20 365.50 400.15 447.28 517.37 522.72 537.28 629.54 699.47 736.19 790.29 795.30 893.60 1008.35 1026.34 1036.95 1052.27 1078.43 1082.37 1156.14 1182.55 1236.08 1237.35 1265.70 1285.78 1292.70 1377.22 1431.94 1516.49 1561.85 1666.23 1694.83 3277.80 3287.15 3291.91 3304.34 3308.56
formula: C7H5F4Si
InChI: InChI=1/C7H5F4Si/c8-7(9,10)12(11)6-4-2-1-3-5-6/h1-5H
17 atoms
F  2.256451 1.141201 -1.705593
Si 1.736637 0.290844 -0.49129
C  3.190299 -0.444836 0.537533
F  2.711484 -1.132854 1.566116
F  3.926357 -1.235995 -0.223836
F  3.928223 0.558759 0.986422
C  -0.009796 0.16529 -0.244593
C  -0.859264 0.897606 -1.104299
C  -2.223541 0.816564 -0.936456
C  -2.749998 0.009534 0.068939
C  -1.921917 -0.718921 0.919008
C  -0.553576 -0.644536 0.775466
H  -0.456731 1.523958 -1.890249
H  -2.881262 1.377656 -1.585211
H  -3.823224 -0.052467 0.191481
H  -2.350363 -1.340893 1.692097
H  0.080121 -1.211008 1.444663
totalener: -956.68865161 hartree
nucrepener: 795.59670464 hartree
electener: -1752.28535625 hartree
oneelecener: -2885.27314277 hartree
twoeener: 1132.98778651 hartree
kineticenergy: 951.79700848 hartree
exchangeener: -55.085898615887 hartree
correlationener: -4.425064054781 hartree
xcener: -59.510962670668 hartree
energy: -1824.7971 -689.2215 -688.9626 -688.8850 -688.8813 -296.3448 -290.1849 -289.9012 -289.8694 -289.5082 -289.1426 -289.1329 -158.5568 -112.1848 -112.0527 -111.9267 -44.4397 -42.0489 -41.9040 -41.8735 -31.2677 -28.1329 -28.0222 -26.6267 -24.2961 -23.7190 -23.4393 -23.1857 -23.1548 -22.0499 -21.1951 -20.1549 -20.0276 -19.6974 -19.6768 -19.3023 -19.1657 -18.7633 -18.7256 -18.2084 -18.1722 -18.0412 -16.7786 -16.5415 -15.8856 -15.4017 -13.5333 -13.0790 -7.5597 -5.0503 -4.4320 -4.3444 -3.8953 -0.9086 -0.0017 0.0255 0.8917 1.1112 1.1501 1.3135 2.2910 2.5519 2.6861 3.3188 3.6558 4.0758 4.5433 4.6900 6.0639 6.7055 7.2923 7.5799 8.2637 8.6907 9.6017 9.6228 10.0619 10.7913 11.2819 11.3403 11.7242 11.7723 12.1222 12.3534 12.5172 12.8889 13.4008 13.4835 13.8843 14.2526 15.8222 16.4797 17.2645 17.9952 18.7951 20.6554 21.0759 21.4622 21.8062 22.2536 22.7605 22.9064 23.3554 23.6369 24.0805 24.8846 25.1110 25.4758 26.2288 26.5287 26.7395 27.0006 27.5370 27.7549 27.9272 28.2272 28.8255 28.9727 29.1910 29.2935 29.3862 29.4191 29.6563 29.9794 30.3018 30.7170 31.0639 31.4356 32.1191 32.4139 32.7762 32.8531 33.6128 34.9595 35.8320 36.9859 37.0740 37.4129 37.9527 39.1200 39.7108 40.9430 41.0645 41.6539 44.0599 45.0443 46.0983 46.2745 47.0456 50.3450 50.8100 51.0036 51.9731 53.1607 53.3082 53.4588 54.6532 54.6612 55.1551 55.3480 56.6886 57.5744 59.0420 59.2255 59.8820 62.1337 63.6266 64.4027 65.1220 66.9169 69.0650 69.5467 69.9786 70.5637 71.2102 72.2765 75.7917 75.8270 76.6690 78.7116 81.8248 88.5528 356.0392 366.1005 367.4989 378.2433 378.6434 379.6790 390.3868 885.9955 886.1883 887.9219 894.7010 electronvolt
chargesum: 1.0000000
charge: -0.389279 1.231066 0.765554 -0.266394 -0.256816 -0.260310 -0.225326 -0.240502 -0.195576 -0.187115 -0.193129 -0.228860 0.285706 0.292293 0.298138 0.291436 0.279114
charge: -0.155754 0.913376 0.272063 -0.093995 -0.081647 -0.084384 -0.244858 -0.064604 -0.105281 -0.029919 -0.106111 -0.068213 0.169133 0.171365 0.172531 0.170884 0.165416
qa: -0.3893 1.2311 0.7656 -0.2664 -0.2568 -0.2603 -0.2253 -0.2405 -0.1956 -0.1871 -0.1931 -0.2289 0.2857 0.2923 0.2981 0.2914 0.2791
va: 1.0993 3.4223 3.9472 1.1472 1.1563 1.1526 3.6793 3.7826 3.7768 3.7432 3.7787 3.7599 0.8880 0.8827 0.8792 0.8831 0.8958
dispersion: -0.009834289 hartree
energy: -956.664013475842 hartree
dipole: -21.89044 19.95703 -1.93341 0.89776 -0.69089 0.20686 -0.67824 0.38934 -0.28890
magnitude: 1.96579 au
magnitude: 4.99665 debye
temp: 298.15 k
press: 1.00 atm
zeropoint: 0.11253105 hartree
thermalvibcorrection: 0.00827565 hartree
thermalrotcorrection: 0.00141627 hartree
thermaltrasncorrection: 0.00141627 hartree
thermaltotal: -956.54037424 hartree
thermalcorr: 0.01110819 hartree
nonthermalcorr: 0.11253105 hartree
totalcorr: 0.12363923 hartree
thermalcorrenthalpy: 0.00094421 hartree
totalenthalpy: -956.53943003 hartree
vibrat: 0.01494163 hartree
rotat: 0.01487014 hartree
transl: 0.01980390 hartree
total: 0.04961567 hartree
totalentropycorr: -0.04961567 hartree
gibbsenthalpy: -956.58904570 hartree
gibbsminuselec: 0.07496778 hartree
