program: Orca
programVersion: 5.0.4
elementType: F Si C F F F C C C C C C H H H H H
charge: 1
multiplicity: 1
keywords: SP DSD-BLYP D3BJ def2-QZVPP def2-QZVPP/C def2/J TightSCF
formula: C7H5F4Si
InChI: InChI=1/C7H5F4Si/c8-7(9,10)12(11)6-4-2-1-3-5-6/h1-5H
17 atoms
F  1.111037 1.158129 -1.695649
Si 0.591223 0.307773 -0.481346
C  2.044884 -0.427908 0.547476
F  1.566069 -1.115926 1.57606
F  2.780942 -1.219067 -0.213892
F  2.782809 0.575688 0.996366
C  -1.155211 0.182218 -0.234649
C  -2.004679 0.914535 -1.094355
C  -3.368956 0.833492 -0.926512
C  -3.895413 0.026462 0.078883
C  -3.067332 -0.701993 0.928952
C  -1.69899 -0.627608 0.78541
H  -1.602145 1.540886 -1.880306
H  -4.026677 1.394584 -1.575267
H  -4.968638 -0.035538 0.201425
H  -3.495777 -1.323965 1.702041
H  -1.065293 -1.194079 1.454607
totalener: -956.73768606 hartree
nucrepener: 795.59670442 hartree
electener: -1752.33439048 hartree
oneelecener: -2885.95706267 hartree
twoeener: 1133.62267219 hartree
kineticenergy: 955.01045021 hartree
exchangeener: -30.658378487237 hartree
correlationener: -1.894091426392 hartree
xcener: -32.552469913630 hartree
chargesum: 1.0000000
charge: -0.315948 1.001783 0.578445 -0.212346 -0.196659 -0.198133 -0.043415 -0.034707 -0.094388 -0.008216 -0.092905 -0.046386 0.128566 0.135048 0.145177 0.136409 0.117675
charge: 0.346517 0.297611 -1.258970 0.425652 0.438464 0.436687 -0.149140 0.119715 0.118998 0.162996 0.118074 0.114881 -0.030470 -0.037365 -0.029214 -0.037819 -0.036616
qa: -0.3159 1.0018 0.5784 -0.2123 -0.1967 -0.1981 -0.0434 -0.0347 -0.0944 -0.0082 -0.0929 -0.0464 0.1286 0.1350 0.1452 0.1364 0.1177
va: 1.1292 3.6775 4.1197 1.0989 1.1277 1.1230 3.6690 3.7585 3.8289 3.8023 3.8159 3.7532 0.9801 0.9801 0.9705 0.9796 0.9919
total: -957.881724405 hartree
dispersion: -0.014253477 hartree
energy: -957.895977882412 hartree
dipole: -21.89044 19.75674 -2.13370 0.89776 -0.68069 0.21707 -0.67824 0.37504 -0.30320
magnitude: 2.16604 au
magnitude: 5.50564 debye
