program: Orca
programVersion: 5.0.4
elementType: F Si F C F F F C C C C C C H H H H H
charge: 0
multiplicity: 1
keywords: Opt RIJCOSX PBEh-3c
formula: C7H5F5Si
InChI: InChI=1/C7H5F5Si/c8-7(9,10)13(11,12)6-4-2-1-3-5-6/h1-5H
18 atoms
F  -1.894458 -0.633942 -2.139015
Si -1.541003 -0.874177 -0.594649
F  -1.642155 -2.443451 -0.284015
C  -2.923526 -0.007647 0.411044
F  -2.953524 1.310289 0.139135
F  -2.692613 -0.135111 1.726168
F  -4.147796 -0.490049 0.171412
C  0.131723 -0.250781 -0.160231
C  0.431971 1.111065 -0.2510
C  1.69622 1.576121 0.070392
C  2.676208 0.686834 0.487573
C  2.392144 -0.66693 0.583728
C  1.127139 -1.133737 0.263085
H  -0.319166 1.822344 -0.571525
H  1.916848 2.632546 -0.002657
H  3.663708 1.050636 0.739443
H  3.156076 -1.360389 0.908864
H  0.922305 -2.193522 0.345349
totalener: -1056.74693125 hartree
nucrepener: 953.53847119 hartree
electener: -2010.28540243 hartree
oneelecener: -3358.28948268 hartree
twoeener: 1348.00408025 hartree
kineticenergy: 1051.14856292 hartree
exchangeener: -60.926033103038 hartree
correlationener: -4.901244021786 hartree
xcener: -65.827277124823 hartree
dispersion: -0.010547939 hartree
dispersion: -0.010546430 hartree
dispersion: -0.010556486 hartree
dispersion: -0.010565996 hartree
dispersion: -0.010564708 hartree
dispersion: -0.010564246 hartree
dispersion: -0.010565405 hartree
energy: -1819.1603 -684.0036 -683.9473 -683.9437 -683.3984 -683.2987 -290.7937 -285.0933 -285.0740 -284.9802 -284.9011 -284.8640 -284.8561 -152.7430 -106.3413 -106.2765 -106.2045 -39.3334 -36.8199 -36.8064 -36.4094 -35.9246 -26.6682 -23.4890 -23.4565 -21.6614 -19.4094 -19.1969 -18.5379 -18.1743 -18.1522 -17.0917 -16.5587 -15.7725 -15.0719 -14.8929 -14.8057 -14.7489 -14.6143 -14.5159 -14.1029 -13.9034 -13.8005 -13.6414 -13.6157 -13.2068 -13.1528 -12.2010 -11.5903 -11.4428 -10.3296 -8.7871 -8.6285 -0.7401 -0.0875 1.5486 2.4042 2.7288 3.9371 4.2218 4.8485 4.9804 5.3620 5.9549 6.2669 6.5917 6.8272 7.2358 7.7174 8.3999 8.4063 8.8170 9.0726 10.8292 11.8629 12.0282 12.4576 12.9577 13.6160 14.1038 14.6810 15.2890 15.4688 16.0808 16.2795 16.5275 16.6523 16.6654 17.0083 17.4440 17.7167 18.0723 18.7885 19.7079 20.4461 20.8806 21.2588 21.9107 22.4743 23.3661 24.2156 25.1435 25.5368 25.8218 26.1583 27.0150 27.4301 27.7299 28.0484 28.2106 28.6971 29.1585 29.2394 30.5658 30.9771 31.1559 31.2772 31.3764 32.0949 32.2870 32.5434 33.0236 33.0843 33.1866 33.3713 33.5591 33.6626 33.8947 34.0522 34.1714 34.2855 34.7881 35.0033 35.4612 35.6838 36.0540 36.6624 36.8467 37.2849 37.3190 37.7219 37.8707 38.4268 39.2184 39.8487 41.1214 41.3335 41.5132 42.0117 42.8541 43.9102 45.0489 45.8517 46.1457 47.1631 48.2646 48.9633 50.0242 50.5077 51.2436 51.4749 51.8689 54.8563 55.6819 55.8784 57.2135 57.5585 58.0563 59.2394 59.4235 59.6017 59.8395 59.9563 61.4965 61.9873 63.9370 64.1447 64.7951 67.9834 68.3433 68.6117 69.8379 71.3151 73.8469 74.4662 74.8582 75.2689 75.8165 76.7995 79.9029 80.5294 81.6092 81.8499 83.4359 85.2196 93.3614 360.4251 370.8559 371.6388 382.6255 383.5417 384.0374 395.4229 890.3747 890.9979 892.2625 894.4054 898.8519 electronvolt
chargesum: -0.0000000
charge: -0.437012 1.257880 -0.443258 0.723963 -0.313280 -0.306282 -0.300279 -0.207462 -0.262727 -0.205704 -0.222261 -0.202491 -0.262125 0.238262 0.232538 0.234338 0.231724 0.244176
charge: -0.222009 0.661006 -0.223201 0.264031 -0.140909 -0.133258 -0.127217 -0.209555 -0.109273 -0.129802 -0.109756 -0.130621 -0.108732 0.145082 0.142531 0.142110 0.142194 0.147379
qa: -0.4370 1.2579 -0.4433 0.7240 -0.3133 -0.3063 -0.3003 -0.2075 -0.2627 -0.2057 -0.2223 -0.2025 -0.2621 0.2383 0.2325 0.2343 0.2317 0.2442
va: 1.0070 3.8779 0.9994 3.8111 1.0912 1.0977 1.1058 3.6799 3.8308 3.8139 3.8127 3.8061 3.8360 0.9094 0.9067 0.9061 0.9070 0.9072
dispersion: -0.010566100 hartree
energy: -1056.718257650100 hartree
dipole: 21.20263 -19.89384 1.30879 4.09757 -3.79862 0.29895 1.72355 -1.56032 0.16323
magnitude: 1.35238 au
magnitude: 3.43748 debye
