program: Orca
programVersion: 5.0.4
elementType: N Si F F N H H H H
charge: 0
multiplicity: 1
keywords: Freq RIJCOSX PBEh-3c
frequency: 0.00 0.00 0.00 0.00 0.00 0.00 217.63 230.49 263.39 341.50 346.85 367.23 392.61 404.04 439.71 774.74 835.64 861.78 943.31 1005.57 1018.49 1655.16 1659.55 3692.31 3694.42 3791.65 3794.07
frequency: 217.63 230.49 263.39 341.50 346.85 367.23 392.61 404.04 439.71 774.74 835.64 861.78 943.31 1005.57 1018.49 1655.16 1659.55 3692.31 3694.42 3791.65 3794.07
formula: H4F2N2Si
InChI: InChI=1/F2H4N2Si/c1-5(2,3)4/h3-4H2
9 atoms
N  -1.104843 -0.938511 0.113542
Si -0.204316 0.489548 0.272924
F  -0.419059 1.354995 1.613295
F  -0.762435 1.458587 -0.885189
N  1.450262 0.11649 0.248447
H  -2.038438 -0.945358 -0.258373
H  -0.904978 -1.755272 0.663055
H  1.840395 -0.49617 -0.445767
H  2.143412 0.71549 0.661667
totalener: -600.33234654 hartree
nucrepener: 263.95790870 hartree
electener: -864.29025524 hartree
oneelecener: -1357.69558591 hartree
twoeener: 493.40533067 hartree
kineticenergy: 597.54811978 hartree
exchangeener: -30.978201829814 hartree
correlationener: -2.355372040852 hartree
xcener: -33.333573870667 hartree
energy: -1818.4792 -682.1184 -682.1013 -397.7940 -397.7928 -151.9129 -105.5075 -105.4701 -105.4261 -35.2597 -34.6960 -26.0724 -25.4819 -17.0190 -15.5022 -15.4643 -14.4917 -14.4262 -14.0633 -13.0936 -12.8125 -12.5315 -12.2307 -8.9603 -8.8624 2.5738 4.0434 4.3223 4.4140 5.4348 5.7329 6.5436 6.8306 8.5468 12.5879 13.3738 13.7734 14.8861 16.4675 19.3637 20.1570 22.6534 22.8723 24.4062 25.5678 26.7966 26.9640 27.4749 27.6081 28.0097 29.1414 30.9745 33.0105 34.0424 34.5583 34.6650 35.2390 35.4441 35.7884 36.0198 36.3174 37.6975 38.9657 39.4321 41.7424 42.6488 43.5313 45.2174 46.3870 47.6298 50.2475 50.9924 55.0171 55.7443 60.8762 63.0507 64.5450 66.2787 68.7053 71.6286 80.4305 81.8119 517.7139 518.7237 892.7835 892.9615 electronvolt
chargesum: 0.0000000
charge: -0.942942 1.380014 -0.471701 -0.472300 -0.942644 0.363825 0.360981 0.361209 0.363558
charge: -0.554213 0.598401 -0.249543 -0.250142 -0.554364 0.253015 0.251870 0.252162 0.252812
qa: -0.9429 1.3800 -0.4717 -0.4723 -0.9426 0.3638 0.3610 0.3612 0.3636
va: 2.8115 4.0570 0.9429 0.9417 2.8117 0.8411 0.8431 0.8429 0.8412
dispersion: -0.003073972 hartree
energy: -600.320479822014 hartree
dipole: 2.50552 -2.09480 0.41071 -5.97192 4.99986 -0.97206 -0.61966 0.51396 -0.10570
magnitude: 1.06055 au
magnitude: 2.69570 debye
temp: 298.15 k
press: 1.00 atm
zeropoint: 0.06089575 hartree
thermalvibcorrection: 0.00382753 hartree
thermalrotcorrection: 0.00141627 hartree
thermaltrasncorrection: 0.00141627 hartree
thermaltotal: -600.25292400 hartree
thermalcorr: 0.00666007 hartree
nonthermalcorr: 0.06089575 hartree
totalcorr: 0.06755582 hartree
thermalcorrenthalpy: 0.00094421 hartree
totalenthalpy: -600.25197979 hartree
vibrat: 0.00600797 hartree
rotat: 0.01244849 hartree
transl: 0.01884448 hartree
total: 0.03730093 hartree
totalentropycorr: -0.03730093 hartree
gibbsenthalpy: -600.28928073 hartree
gibbsminuselec: 0.03119909 hartree
