program: Orca
programVersion: 5.0.4
elementType: N Si N H H H H
charge: 2
multiplicity: 1
keywords: Freq RIJCOSX PBEh-3c
frequency: 0.00 0.00 0.00 0.00 0.00 0.00 192.49 192.55 447.81 669.61 669.66 870.96 871.05 893.83 1310.67 1567.43 1577.82 3396.43 3421.98 3490.02 3490.03
frequency: 192.49 192.55 447.81 669.61 669.66 870.96 871.05 893.83 1310.67 1567.43 1577.82 3396.43 3421.98 3490.02 3490.03
formula: H4N2Si
InChI: InChI=1/H4N2Si/c1-3-2/h1-2H2
7 atoms
N  -1.605688 -0.030698 0.005049
Si 0.000014 -0.002036 -0.000659
N  1.605696 0.027573 -0.006238
H  -2.167258 -0.288213 0.829246
H  -2.182355 0.217015 -0.811666
H  2.160205 0.858197 0.245916
H  2.189286 -0.781838 -0.261549
totalener: -399.98063044 hartree
nucrepener: 104.62059784 hartree
electener: -504.60122828 hartree
oneelecener: -742.81669926 hartree
twoeener: 238.21547098 hartree
kineticenergy: 398.55280412 hartree
exchangeener: -19.284808981037 hartree
correlationener: -1.403148122849 hartree
xcener: -20.687957103887 hartree
energy: -1833.3086 -412.2736 -412.2716 -167.0362 -120.6380 -120.6378 -120.3625 -39.9363 -39.3700 -29.9264 -28.4616 -28.4613 -27.8593 -23.1080 -23.1066 -14.5966 -13.4674 -13.4644 -7.3778 -6.4165 -6.0925 -6.0918 -4.7799 -3.0001 -0.8007 -0.2046 -0.2027 -0.1846 1.6949 1.6976 4.7494 6.2673 10.1895 10.1934 10.5297 14.0958 15.1089 15.1096 16.7720 18.4149 18.4197 21.2730 24.6741 29.5474 33.0786 34.0724 40.7635 40.7745 46.2965 47.4430 53.6799 53.6803 54.0241 54.8878 502.0866 506.5806 electronvolt
chargesum: 2.0000000
charge: -0.773749 1.442726 -0.773753 0.526183 0.526204 0.526198 0.526191
charge: -0.367096 1.257399 -0.367096 0.369196 0.369200 0.369220 0.369178
qa: -0.7737 1.4427 -0.7738 0.5262 0.5262 0.5262 0.5262
va: 3.0600 3.3114 3.0600 0.7133 0.7132 0.7132 0.7132
dispersion: -0.002076253 hartree
energy: -399.976461502378 hartree
dipole: -0.00014 0.00008 -0.00006 0.01084 -0.00495 0.00589 0.00390 -0.00153 0.00237
magnitude: 0.00635 au
magnitude: 0.01614 debye
temp: 298.15 k
press: 1.00 atm
zeropoint: 0.05253986 hartree
thermalvibcorrection: 0.00185553 hartree
thermalrotcorrection: 0.00141627 hartree
thermaltrasncorrection: 0.00141627 hartree
thermaltotal: -399.91923357 hartree
thermalcorr: 0.00468807 hartree
nonthermalcorr: 0.05253986 hartree
totalcorr: 0.05722793 hartree
thermalcorrenthalpy: 0.00094421 hartree
totalenthalpy: -399.91828936 hartree
vibrat: 0.00304093 hartree
rotat: 0.01030199 hartree
transl: 0.01815089 hartree
total: 0.03149380 hartree
totalentropycorr: -0.03149380 hartree
gibbsenthalpy: -399.94978317 hartree
gibbsminuselec: 0.02667834 hartree
