program: Orca
programVersion: 5.0.4
elementType: N Si N C H H H H H H
charge: 2
multiplicity: 1
keywords: Opt RIJCOSX PBEh-3c
formula: CH6N2Si
InChI: InChI=1/CH6N2Si/c1-3-4-2/h3H,2H2,1H3
10 atoms
N  2.489092 0.010168 -0.245959
Si 0.925275 -0.320544 -0.04938
N  -0.643699 -0.599591 0.14711
C  -1.777757 0.401835 0.262563
H  2.938943 0.097326 -1.165658
H  3.143474 0.137643 0.536001
H  -0.953065 -1.578033 0.208327
H  -2.468916 0.191886 -0.550699
H  -2.245802 0.239246 1.230808
H  -1.407646 1.419964 0.188987
totalener: -439.22574844 hartree
nucrepener: 160.03412658 hartree
electener: -599.25987502 hartree
oneelecener: -903.24222426 hartree
twoeener: 303.98234924 hartree
kineticenergy: 437.48976163 hartree
exchangeener: -22.561619796219 hartree
correlationener: -1.739555801909 hartree
xcener: -24.301175598128 hartree
dispersion: -0.003538993 hartree
dispersion: -0.003538999 hartree
dispersion: -0.003538917 hartree
dispersion: -0.003538828 hartree
energy: -1832.3212 -411.8396 -411.6563 -295.0864 -166.0833 -119.6871 -119.6698 -119.4145 -39.4100 -38.8611 -31.6587 -29.0871 -27.9252 -27.4798 -25.0875 -24.0939 -22.5182 -22.3586 -20.8584 -14.0068 -12.8336 -12.7980 -6.8777 -6.0778 -5.6240 -5.0107 -4.6273 -3.6589 -3.2716 -3.1578 -2.1925 -0.0257 0.3846 0.4214 0.7756 1.7613 2.1378 4.9154 5.4859 5.6992 7.3797 8.5989 10.8683 12.0809 12.6919 15.1629 15.6408 16.8010 18.1591 18.5385 19.0961 19.4275 19.9102 21.6636 23.1143 27.8870 30.6679 30.9489 34.1437 39.3524 40.6111 42.6523 43.4376 47.5109 48.4975 51.1543 52.1478 53.3714 54.3534 54.9448 58.0924 62.0416 362.5019 503.8389 508.3271 electronvolt
chargesum: 2.0000000
charge: -0.781778 1.374971 -0.626317 -0.516638 0.517052 0.517052 0.502347 0.356600 0.356372 0.300338
charge: -0.375746 1.188608 -0.259999 -0.205911 0.361759 0.361771 0.353918 0.200159 0.199992 0.175451
qa: -0.7818 1.3750 -0.6263 -0.5166 0.5171 0.5171 0.5023 0.3566 0.3564 0.3003
va: 3.0570 3.3652 3.1497 3.3808 0.7216 0.7216 0.7259 0.8459 0.8460 0.8804
dispersion: -0.003538830 hartree
energy: -439.217173706812 hartree
dipole: -3.19374 4.29860 1.10486 1.38906 -1.64344 -0.25437 0.35960 -0.48666 -0.12707
magnitude: 1.14086 au
magnitude: 2.89984 debye
