program: Orca
programVersion: 5.0.4
elementType: C N Si F N C H H H H H H H H
charge: 1
multiplicity: 1
keywords: Freq RIJCOSX PBEh-3c
frequency: 0.00 0.00 0.00 0.00 0.00 0.00 94.28 104.21 132.49 133.93 138.46 207.97 332.69 367.97 428.57 555.77 620.65 762.19 926.97 1049.53 1133.66 1161.74 1170.73 1177.17 1190.08 1192.25 1465.31 1466.56 1524.18 1526.31 1542.66 1543.23 1569.21 1569.90 3146.19 3146.77 3242.75 3243.25 3252.73 3252.80 3642.38 3648.39
frequency: 94.28 104.21 132.49 133.93 138.46 207.97 332.69 367.97 428.57 555.77 620.65 762.19 926.97 1049.53 1133.66 1161.74 1170.73 1177.17 1190.08 1192.25 1465.31 1466.56 1524.18 1526.31 1542.66 1543.23 1569.21 1569.90 3146.19 3146.77 3242.75 3243.25 3252.73 3252.80 3642.38 3648.39
formula: C2H8FN2Si
InChI: InChI=1/C2H8FN2Si/c1-4-6(3)5-2/h4-5H,1-2H3
14 atoms
C  -2.718736 -0.443387 -0.638319
N  -1.504919 -0.167879 0.146952
Si 0.03504 -0.061697 -0.409244
F  0.258411 -0.330908 -1.937846
N  1.368793 0.306022 0.472627
C  2.749575 0.421674 -0.023005
H  -3.188265 -1.360039 -0.289704
H  -2.477969 -0.560729 -1.691087
H  -3.417954 0.383223 -0.537932
H  -1.683475 -0.026966 1.132846
H  1.275728 0.482655 1.464419
H  2.788612 0.257278 -1.09607
H  3.382828 -0.317807 0.460886
H  3.132331 1.41836 0.182777
totalener: -578.75760181 hartree
nucrepener: 318.05816053 hartree
electener: -896.81576234 hartree
oneelecener: -1417.24055190 hartree
twoeener: 520.42478956 hartree
kineticenergy: 575.97300668 hartree
exchangeener: -31.706378231163 hartree
correlationener: -2.556763539257 hartree
xcener: -34.263141770419 hartree
energy: -1824.5689 -688.8836 -404.3152 -404.3083 -289.4680 -289.4611 -158.2444 -111.8540 -111.7923 -111.6786 -41.7535 -32.7181 -32.2426 -25.9597 -25.3762 -22.8818 -21.4604 -20.5932 -19.9062 -19.5753 -19.3220 -18.5203 -18.2891 -18.1699 -16.8148 -16.5684 -14.8114 -13.6661 -4.9272 -4.4038 -2.7434 -1.3263 -0.9104 0.8256 0.8521 1.0939 1.4895 1.6391 1.6715 1.8668 2.1119 2.8629 3.4777 5.8574 8.2321 8.3957 8.7687 8.7989 9.8024 10.0943 10.5530 11.6953 11.8225 11.9561 14.2600 16.1968 17.0821 18.0865 19.3125 20.4622 21.0497 21.6674 22.9767 23.2450 23.4347 23.5826 24.2237 24.3536 24.8834 25.2249 26.9531 28.2333 28.6393 28.6806 29.2301 30.4943 32.0270 33.6606 34.7179 35.1791 36.4723 36.5206 38.8079 41.2939 43.0898 43.5051 47.3937 47.8417 48.3322 50.9506 51.0454 54.3145 54.4948 55.3633 56.8607 60.0861 60.2916 60.6544 60.8909 63.9318 65.9338 68.3329 70.1904 76.7474 368.4123 368.9398 514.5712 515.0701 887.6610 electronvolt
chargesum: 1.0000000
charge: -0.506428 -0.705684 1.367743 -0.413029 -0.705415 -0.506585 0.279734 0.263455 0.279416 0.412237 0.412154 0.263395 0.279511 0.279495
charge: -0.242620 -0.339853 0.827822 -0.164299 -0.339689 -0.242696 0.152767 0.153390 0.152989 0.291643 0.291480 0.153445 0.152550 0.153072
qa: -0.5064 -0.7057 1.3677 -0.4130 -0.7054 -0.5066 0.2797 0.2635 0.2794 0.4122 0.4122 0.2634 0.2795 0.2795
va: 3.5936 3.0571 3.7772 1.0557 3.0573 3.5936 0.8840 0.9003 0.8844 0.8000 0.8002 0.9005 0.8840 0.8845
dispersion: -0.005741241 hartree
energy: -578.741368851682 hartree
dipole: -0.67271 0.48761 -0.18510 0.93957 -0.71499 0.22458 4.39408 -3.14284 1.25124
magnitude: 1.28464 au
magnitude: 3.26530 debye
temp: 298.15 k
press: 1.00 atm
zeropoint: 0.11769914 hartree
thermalvibcorrection: 0.00568889 hartree
thermalrotcorrection: 0.00141627 hartree
thermaltrasncorrection: 0.00141627 hartree
thermaltotal: -578.61514828 hartree
thermalcorr: 0.00852143 hartree
nonthermalcorr: 0.11769914 hartree
totalcorr: 0.12622057 hartree
thermalcorrenthalpy: 0.00094421 hartree
totalenthalpy: -578.61420408 hartree
vibrat: 0.01033473 hartree
rotat: 0.01306172 hartree
transl: 0.01896950 hartree
total: 0.04236595 hartree
totalentropycorr: -0.04236595 hartree
gibbsenthalpy: -578.65657003 hartree
gibbsminuselec: 0.08479882 hartree
