program: Orca
programVersion: 5.0.4
elementType: C N Si F F N C H H H H H H H H
charge: 0
multiplicity: 1
keywords: Opt RIJCOSX PBEh-3c
formula: C2H8F2N2Si
InChI: InChI=1/C2H8F2N2Si/c1-5-7(3,4)6-2/h5-6H,1-2H3
15 atoms
C  1.728062 0.984523 0.006567
N  1.148609 0.174689 -1.042666
Si 0.184395 -1.191966 -0.761419
F  0.908577 -2.429015 -0.022557
F  -0.174685 -1.753903 -2.228657
N  -1.123742 -0.795058 0.242413
C  -1.933593 0.398314 0.132661
H  2.77196 0.733306 0.213638
H  1.67944 2.047881 -0.236029
H  1.17098 0.842009 0.932069
H  1.586358 0.288149 -1.942141
H  -1.514738 -1.503932 0.841118
H  -1.410011 1.14344 -0.464157
H  -2.902144 0.218672 -0.34217
H  -2.119169 0.842992 1.112929
totalener: -678.77443382 hartree
nucrepener: 428.56935225 hartree
electener: -1107.34378607 hartree
oneelecener: -1790.15965366 hartree
twoeener: 682.81586759 hartree
kineticenergy: 675.30999940 hartree
exchangeener: -37.538426471769 hartree
correlationener: -3.033901900100 hartree
xcener: -40.572328371869 hartree
dispersion: -0.006653652 hartree
dispersion: -0.006654294 hartree
energy: -1818.4244 -682.1840 -682.1651 -397.9297 -397.9280 -284.7377 -284.7096 -151.8564 -105.4557 -105.4066 -105.3689 -35.2836 -34.7484 -26.8812 -26.3828 -20.5765 -20.3798 -17.0839 -15.5148 -15.0216 -14.6168 -14.1940 -14.0128 -13.4342 -13.1523 -13.1197 -12.7489 -12.7312 -12.4688 -11.7285 -11.2059 -8.1880 -8.1184 2.6482 3.6980 3.9801 4.3204 4.8742 5.4423 5.5554 5.6673 5.7790 6.2116 6.3372 6.6703 7.3811 7.9118 9.3426 12.3943 12.5504 13.3886 13.8438 14.0799 14.5150 15.7149 16.5496 17.2765 17.9475 19.0709 21.4508 22.4993 23.2368 24.0457 25.4737 26.5883 26.7698 27.3875 27.5628 27.8512 28.0526 28.2220 28.6176 28.9543 29.0130 30.8798 31.1607 32.0016 32.0983 33.3780 34.2021 34.6467 34.7096 35.6915 36.1997 36.5228 37.6371 37.8175 38.2513 40.3751 40.6963 41.2032 41.3662 43.3245 44.4790 46.3996 47.3396 48.5071 49.0194 51.6943 51.9799 53.4254 55.1301 57.5192 57.6217 58.5079 58.9949 62.5089 63.2947 65.9731 66.4516 66.7265 66.9269 69.5366 70.6318 73.3093 76.1727 81.0700 82.0751 373.4204 373.9354 520.6700 521.9980 892.6323 893.2808 electronvolt
chargesum: -0.0000000
charge: -0.481015 -0.747343 1.371737 -0.466173 -0.466101 -0.744657 -0.479253 0.213959 0.212481 0.225008 0.356469 0.355684 0.226971 0.211912 0.210321
charge: -0.257518 -0.406538 0.600161 -0.249201 -0.248004 -0.403526 -0.257536 0.111907 0.114519 0.131730 0.253604 0.253212 0.132534 0.110913 0.113745
qa: -0.4810 -0.7473 1.3717 -0.4662 -0.4661 -0.7447 -0.4793 0.2140 0.2125 0.2250 0.3565 0.3557 0.2270 0.2119 0.2103
va: 3.7353 2.9132 4.0515 0.9523 0.9531 2.9205 3.7342 0.9029 0.9073 0.9159 0.8396 0.8397 0.9169 0.9033 0.9077
dispersion: -0.006655571 hartree
energy: -678.753301712971 hartree
dipole: -2.10443 1.94377 -0.16066 12.72723 -11.80067 0.92656 5.50191 -5.11548 0.38643
magnitude: 1.01669 au
magnitude: 2.58422 debye
