program: Orca
programVersion: 5.0.4
elementType: C N Si N C H H H H H H H H
charge: 2
multiplicity: 1
keywords: SP DSD-BLYP D3BJ def2-QZVPP def2-QZVPP/C def2/J TightSCF
formula: C2H8N2Si
InChI: InChI=1/C2H8N2Si/c1-3-5-4-2/h3-4H,1-2H3
13 atoms
C  -2.597109 0.732271 0.390361
N  -1.529648 -0.335052 0.454539
Si -0.031429 -0.286939 -0.131549
N  1.47998 -0.16322 -0.670731
C  2.706357 0.309785 0.074759
H  -3.433771 0.323644 -0.171176
H  -2.22277 1.628252 -0.095661
H  -2.886633 0.957075 1.414331
H  -1.839934 -1.200945 0.909652
H  1.671218 -0.4554 -1.635635
H  3.415721 -0.514109 0.087491
H  3.10505 1.16138 -0.47151
H  2.455247 0.602396 1.089904
totalener: -478.48239732 hartree
nucrepener: 221.70337761 hartree
electener: -700.18577493 hartree
oneelecener: -1076.79275650 hartree
twoeener: 376.60698156 hartree
kineticenergy: 477.63693771 hartree
exchangeener: -14.379988775015 hartree
correlationener: -0.876533431361 hartree
xcener: -15.256522206376 hartree
chargesum: 2.0000000
charge: 0.017985 -0.291448 1.213539 -0.293622 0.017558 0.158834 0.089170 0.158680 0.260271 0.261533 0.158485 0.159608 0.089407
charge: 0.297019 0.502023 0.776278 0.502006 0.297464 -0.028451 -0.041068 -0.027946 -0.089782 -0.090021 -0.028314 -0.028217 -0.040991
qa: 0.0180 -0.2914 1.2135 -0.2936 0.0176 0.1588 0.0892 0.1587 0.2603 0.2615 0.1585 0.1596 0.0894
va: 3.6989 3.4306 3.6920 3.4314 3.6977 0.9825 0.9869 0.9824 0.9830 0.9828 0.9825 0.9821 0.9868
total: -478.927969390 hartree
dispersion: -0.007070708 hartree
energy: -478.935040097708 hartree
dipole: 0.24931 -0.29534 -0.04602 2.36118 -2.77924 -0.41807 1.06399 -1.25650 -0.19250
magnitude: 0.46256 au
magnitude: 1.17572 debye
