program: Orca
programVersion: 5.0.4
elementType: C N Si F F N C C H H H H H H H H H H
charge: 0
multiplicity: 1
keywords: Freq RIJCOSX PBEh-3c
frequency: 0.00 0.00 0.00 0.00 0.00 0.00 57.65 81.97 116.13 140.05 153.76 215.86 219.98 232.31 284.82 301.43 334.54 400.28 410.68 442.89 498.19 654.63 840.91 926.58 957.46 1073.59 1132.09 1143.29 1162.38 1184.12 1195.27 1213.25 1273.72 1389.54 1474.29 1506.45 1524.58 1536.69 1541.51 1549.99 1556.34 1565.47 1582.49 1587.40 3071.39 3076.07 3092.38 3122.91 3130.62 3155.82 3197.40 3210.02 3219.65 3692.15
frequency: 57.65 81.97 116.13 140.05 153.76 215.86 219.98 232.31 284.82 301.43 334.54 400.28 410.68 442.89 498.19 654.63 840.91 926.58 957.46 1073.59 1132.09 1143.29 1162.38 1184.12 1195.27 1213.25 1273.72 1389.54 1474.29 1506.45 1524.58 1536.69 1541.51 1549.99 1556.34 1565.47 1582.49 1587.40 3071.39 3076.07 3092.38 3122.91 3130.62 3155.82 3197.40 3210.02 3219.65 3692.15
formula: C3H10F2N2Si
InChI: InChI=1/C3H10F2N2Si/c1-6-8(4,5)7(2)3/h6H,1-3H3
18 atoms
C  2.283897 0.87742 0.025809
N  1.79345 -0.430605 0.399499
Si 0.419914 -1.174628 -0.263266
F  0.515213 -1.536749 -1.831683
F  0.334175 -2.614965 0.455973
N  -0.941913 -0.172364 -0.096995
C  -1.140886 0.667819 1.06149
C  -2.102266 -0.250537 -0.954212
H  1.479983 1.460852 -0.421768
H  2.636984 1.434781 0.895895
H  3.099637 0.836821 -0.701333
H  2.472213 -1.005079 0.872114
H  -1.970028 0.317156 1.68552
H  -1.368963 1.696586 0.762891
H  -0.245631 0.692823 1.679949
H  -1.919483 -0.893445 -1.812065
H  -2.973922 -0.64481 -0.420577
H  -2.372476 0.738824 -1.337141
totalener: -717.99911945 hartree
nucrepener: 526.92891036 hartree
electener: -1244.92802981 hartree
oneelecener: -2038.46049873 hartree
twoeener: 793.53246892 hartree
kineticenergy: 714.19552272 hartree
exchangeener: -40.818385555723 hartree
correlationener: -3.374952632522 hartree
xcener: -44.193338188245 hartree
energy: -1818.4629 -682.2030 -682.1936 -398.1422 -397.9692 -284.7865 -284.6549 -284.6174 -151.8877 -105.4839 -105.4415 -105.4004 -35.3173 -34.7677 -27.4086 -26.6205 -21.6494 -20.5627 -19.4399 -16.7920 -15.4397 -15.0273 -14.8378 -14.2080 -13.9749 -13.8736 -13.3855 -13.2882 -12.9303 -12.7785 -12.5151 -12.1621 -11.7346 -11.5707 -11.1132 -8.1938 -7.6737 2.6574 3.6391 3.9733 4.0782 4.9131 5.1666 5.2872 5.5530 5.7243 5.9867 6.0532 6.2454 6.3884 7.0538 7.2617 7.4831 7.8820 9.5927 12.1076 12.4070 12.9393 13.7625 14.1060 14.6613 15.2138 15.6673 16.4115 16.9006 17.6605 18.0818 18.8063 19.9184 21.7735 22.9258 23.3022 24.5557 25.6491 26.4377 26.9458 27.4099 27.5020 27.8150 27.9665 28.3232 28.4338 28.7677 29.1681 29.4657 29.8033 30.3969 31.5605 32.0063 32.3838 33.5414 34.3343 34.7031 35.1175 35.6281 36.2268 36.5624 37.4914 38.0954 38.2771 39.4740 40.4632 40.7826 41.3107 41.4613 42.6302 44.0243 45.4981 47.3843 48.4536 49.3418 49.7588 51.7286 53.2343 54.5598 55.1240 57.1025 57.5522 57.9518 58.3193 59.0501 59.8567 61.9726 63.0370 63.6938 64.2467 66.2092 66.7974 69.2125 69.9822 71.4034 73.6786 74.4252 77.2917 81.1380 82.2507 372.9727 373.6568 376.3021 521.1669 524.0150 892.8737 893.3879 electronvolt
chargesum: -0.0000000
charge: -0.482255 -0.747622 1.371556 -0.464868 -0.462334 -0.551996 -0.489529 -0.487564 0.224576 0.213315 0.216500 0.357608 0.210238 0.205459 0.234347 0.238623 0.206269 0.207677
charge: -0.257651 -0.407543 0.605953 -0.247301 -0.247644 -0.278053 -0.250821 -0.249000 0.130729 0.114997 0.112889 0.254489 0.111866 0.111916 0.134754 0.136041 0.111203 0.113175
qa: -0.4823 -0.7476 1.3716 -0.4649 -0.4623 -0.5520 -0.4895 -0.4876 0.2246 0.2133 0.2165 0.3576 0.2102 0.2055 0.2343 0.2386 0.2063 0.2077
va: 3.7353 2.9100 4.0383 0.9557 0.9599 3.0370 3.7080 3.7115 0.9144 0.9071 0.9027 0.8386 0.9066 0.9098 0.9186 0.9164 0.9072 0.9090
dispersion: -0.008749547 hartree
energy: -717.973829489024 hartree
dipole: -3.34585 3.46188 0.11603 13.59985 -12.68685 0.91300 3.83364 -3.41610 0.41754
magnitude: 1.01063 au
magnitude: 2.56881 debye
temp: 298.15 k
press: 1.00 atm
zeropoint: 0.14906276 hartree
thermalvibcorrection: 0.00800378 hartree
thermalrotcorrection: 0.00141627 hartree
thermaltrasncorrection: 0.00141627 hartree
thermaltotal: -717.81393040 hartree
thermalcorr: 0.01083632 hartree
nonthermalcorr: 0.14906276 hartree
totalcorr: 0.15989909 hartree
thermalcorrenthalpy: 0.00094421 hartree
totalenthalpy: -717.81298619 hartree
vibrat: 0.01415758 hartree
rotat: 0.01377403 hartree
transl: 0.01934989 hartree
total: 0.04728150 hartree
totalentropycorr: -0.04728150 hartree
gibbsenthalpy: -717.86026769 hartree
gibbsminuselec: 0.11356180 hartree
