program: Orca
programVersion: 5.0.4
elementType: C N Si F F N C C H H H H H H H H H H
charge: 0
multiplicity: 1
keywords: SP DSD-BLYP D3BJ def2-QZVPP def2-QZVPP/C def2/J TightSCF
formula: C3H10F2N2Si
InChI: InChI=1/C3H10F2N2Si/c1-6-8(4,5)7(2)3/h6H,1-3H3
18 atoms
C  2.090144 1.591292 0.214684
N  1.599697 0.283267 0.588374
Si 0.226162 -0.460756 -0.074391
F  0.32146 -0.822877 -1.642808
F  0.140422 -1.901093 0.644849
N  -1.135665 0.541508 0.09188
C  -1.334639 1.381691 1.250365
C  -2.296018 0.463335 -0.765337
H  1.28623 2.174723 -0.232893
H  2.443231 2.148653 1.08477
H  2.905884 1.550693 -0.512458
H  2.278461 -0.291207 1.060989
H  -2.163781 1.031028 1.874396
H  -1.562716 2.410458 0.951767
H  -0.439384 1.406695 1.868824
H  -2.113236 -0.179573 -1.62319
H  -3.167675 0.069062 -0.231702
H  -2.566229 1.452696 -1.148266
totalener: -718.00204003 hartree
nucrepener: 526.92891073 hartree
electener: -1244.93095076 hartree
oneelecener: -2038.79595103 hartree
twoeener: 793.86500027 hartree
kineticenergy: 716.61594142 hartree
exchangeener: -22.710573752475 hartree
correlationener: -1.428347078093 hartree
xcener: -24.138920830568 hartree
chargesum: -0.0000000
charge: -0.006652 -0.538958 1.192031 -0.442224 -0.446374 -0.420657 -0.019660 -0.037389 0.059828 0.066842 0.064907 0.169818 0.053156 0.055486 0.067726 0.079218 0.051432 0.051469
charge: 0.119293 0.473418 -0.861005 0.245185 0.240876 0.314323 0.116471 0.118860 -0.058460 -0.070547 -0.070824 -0.198221 -0.064272 -0.064318 -0.056347 -0.056407 -0.063957 -0.064068
qa: -0.0067 -0.5390 1.1920 -0.4422 -0.4464 -0.4207 -0.0197 -0.0374 0.0598 0.0668 0.0649 0.1698 0.0532 0.0555 0.0677 0.0792 0.0514 0.0515
va: 3.8518 2.9615 4.3193 0.9330 0.9228 2.9026 3.8744 3.9009 0.9950 0.9868 0.9882 1.0326 0.9930 0.9830 0.9938 0.9938 0.9881 0.9871
total: -718.825385288 hartree
dispersion: -0.010870025 hartree
energy: -718.836255313042 hartree
dipole: -3.34585 3.42963 0.08377 13.59985 -12.61185 0.98799 3.83364 -3.40623 0.42740
magnitude: 1.07973 au
magnitude: 2.74447 debye
