program: Orca
programVersion: 5.0.4
elementType: C N C Si F N C C H H H H H H H H H H H H
charge: 1
multiplicity: 1
keywords: SP DSD-BLYP D3BJ def2-QZVPP def2-QZVPP/C def2/J TightSCF
formula: C4H12FN2Si
InChI: InChI=1/C4H12FN2Si/c1-6(2)8(5)7(3)4/h1-4H3
20 atoms
C  1.634632 1.701706 -0.68823
N  1.462847 0.348655 -0.159825
C  2.716307 -0.402885 -0.027202
Si 0.013597 -0.293056 0.274593
F  0.075638 -1.463448 1.324796
N  -1.486148 0.117522 -0.258003
C  -2.714275 -0.360011 0.388734
C  -1.73312 0.971366 -1.421477
H  1.96386 1.674111 -1.726743
H  0.715403 2.280486 -0.624914
H  2.387904 2.222248 -0.096813
H  2.549095 -1.412448 0.341388
H  3.202133 -0.475039 -1.000229
H  3.384942 0.106547 0.665517
H  -3.299324 0.486598 0.74678
H  -2.503324 -1.012797 1.231938
H  -3.309622 -0.919552 -0.33254
H  -0.82029 1.182482 -1.973675
H  -2.185321 1.914223 -1.114074
H  -2.416849 0.4631 -2.101024
totalener: -657.14720849 hartree
nucrepener: 500.47102279 hartree
electener: -1157.61823128 hartree
oneelecener: -1883.92655956 hartree
twoeener: 726.30832828 hartree
kineticenergy: 655.85621334 hartree
exchangeener: -21.302121363668 hartree
correlationener: -1.363403636347 hartree
xcener: -22.665525000014 hartree
chargesum: 1.0000000
charge: -0.001749 -0.351807 -0.008551 1.002343 -0.343655 -0.346888 -0.007552 -0.002044 0.088630 0.062682 0.099002 0.087478 0.092545 0.093261 0.094339 0.092231 0.091968 0.071008 0.090004 0.096756
charge: 0.178085 0.322332 0.189546 -0.155335 0.339143 0.323597 0.190371 0.182003 -0.049479 -0.051908 -0.043569 -0.046320 -0.046784 -0.047024 -0.047516 -0.046489 -0.046358 -0.051809 -0.048329 -0.044157
qa: -0.0017 -0.3518 -0.0086 1.0023 -0.3437 -0.3469 -0.0076 -0.0020 0.0886 0.0627 0.0990 0.0875 0.0925 0.0933 0.0943 0.0922 0.0920 0.0710 0.0900 0.0968
va: 3.8425 3.1469 3.8285 4.2391 1.0917 3.1634 3.8171 3.8342 0.9916 0.9872 0.9896 0.9865 0.9879 0.9912 0.9881 0.9857 0.9898 0.9874 0.9907 0.9900
total: -657.918181459 hartree
dispersion: -0.012519889 hartree
energy: -657.930701347379 hartree
dipole: -0.38188 0.32718 -0.05470 7.48256 -6.84321 0.63935 -6.85972 6.27422 -0.58550
magnitude: 0.86866 au
magnitude: 2.20795 debye
