program: Orca
programVersion: 5.0.4
elementType: C N C Si N C C O H H H H H H H H H H H H
charge: 0
multiplicity: 1
keywords: Opt RIJCOSX PBEh-3c
formula: C4H12N2OSi
InChI: InChI=1/C4H12N2OSi/c1-5(2)8(7)6(3)4/h1-4H3
20 atoms
C  -2.60428 -0.502548 -1.122887
N  -1.399051 -0.121594 -0.412133
C  -1.597917 0.067357 1.004624
Si -0.021737 0.30775 -1.302986
N  1.395179 0.209705 -0.377821
C  2.595526 0.870814 -0.851768
C  1.620594 -0.637122 0.768942
O  -0.051945 0.729501 -2.765475
H  -2.418675 -0.555269 -2.19377
H  -2.965172 -1.480292 -0.789171
H  -3.406532 0.223701 -0.961194
H  -0.717966 0.497681 1.478152
H  -2.430636 0.75452 1.186936
H  -1.831481 -0.8726 1.515154
H  3.381504 0.143172 -1.076058
H  2.392411 1.430319 -1.762397
H  2.986803 1.564143 -0.101075
H  0.748467 -1.246431 0.996298
H  2.451726 -1.324477 0.579847
H  1.873383 -0.05853 1.663581
totalener: -632.83773519 hartree
nucrepener: 489.31186312 hartree
electener: -1122.14959831 hartree
oneelecener: -1839.85428500 hartree
twoeener: 717.70468669 hartree
kineticenergy: 629.55198065 hartree
exchangeener: -37.387805568860 hartree
correlationener: -3.223867209600 hartree
xcener: -40.611672778460 hartree
dispersion: -0.010472826 hartree
energy: -1816.8175 -528.1442 -398.5964 -398.5797 -285.0258 -285.0207 -284.7372 -284.7279 -150.6139 -104.2478 -104.1016 -104.0536 -27.9671 -27.4338 -26.5646 -22.0127 -21.8057 -19.9446 -19.2055 -16.1029 -15.0319 -14.4607 -14.4343 -14.2564 -13.9216 -12.5619 -12.4698 -12.3881 -11.8895 -11.6902 -11.2625 -10.1689 -9.4575 -8.4614 -7.7762 -7.7546 1.2225 1.6021 3.4626 3.8987 4.2237 4.4356 5.0563 5.2494 5.3263 5.7832 5.8824 5.9383 6.1319 6.2680 6.3445 6.6883 7.0030 7.4182 7.8943 8.1693 9.5893 11.7330 12.3014 12.9978 13.0686 14.1789 14.7146 14.8895 15.7922 16.2514 16.4143 16.6122 16.6671 17.9112 18.3555 18.4389 18.6161 19.8585 21.6639 23.0107 24.1387 25.1160 25.6534 26.1325 26.8487 27.1460 27.4546 27.8680 28.0404 28.3425 28.4074 28.7947 28.8568 29.2600 29.6365 29.7654 30.9702 31.3368 31.5613 31.7841 32.5276 32.9493 35.7806 36.3596 39.4333 40.1403 40.9302 41.0968 42.5042 43.3918 44.7005 45.4251 52.3576 52.5634 53.1892 53.8596 54.5294 54.7326 54.8464 56.6217 56.6917 57.1247 57.7283 58.1247 58.1897 59.2732 59.7473 60.3316 61.1455 61.3945 62.5304 62.7422 63.1682 64.1801 64.7523 68.8370 69.0105 70.9098 71.1954 72.2269 75.0072 75.3984 75.6437 79.6793 372.6057 372.8073 375.9197 376.0915 522.7553 524.0488 696.6681 electronvolt
chargesum: -0.0000000
charge: -0.488483 -0.554061 -0.501113 1.030427 -0.552400 -0.489073 -0.501220 -0.642430 0.258318 0.209686 0.211252 0.234806 0.223763 0.210357 0.210682 0.260424 0.209536 0.235924 0.223476 0.210128
charge: -0.247609 -0.275062 -0.251733 0.531874 -0.273058 -0.247823 -0.251852 -0.468455 0.148391 0.113942 0.115790 0.130893 0.119053 0.113249 0.115689 0.149285 0.113819 0.131276 0.119229 0.113100
qa: -0.4885 -0.5541 -0.5011 1.0304 -0.5524 -0.4891 -0.5012 -0.6424 0.2583 0.2097 0.2113 0.2348 0.2238 0.2104 0.2107 0.2604 0.2095 0.2359 0.2235 0.2101
va: 3.6789 3.0470 3.7097 4.2315 3.0501 3.6764 3.7086 2.0916 0.9118 0.9064 0.9098 0.9082 0.9055 0.9062 0.9102 0.9117 0.9065 0.9078 0.9059 0.9062
dispersion: -0.010472029 hartree
energy: -632.815150533589 hartree
dipole: 0.16767 -0.12952 0.03814 -2.41812 1.88887 -0.52925 8.49395 -6.64404 1.84990
magnitude: 1.92450 au
magnitude: 4.89169 debye
