program: Orca
programVersion: 5.0.4
elementType: N Si N C C C C O C C C C H H H H H H H H H H H H H H H H H H H H
charge: 0
multiplicity: 1
keywords: Freq RIJCOSX PBEh-3c
frequency: 0.00 0.00 0.00 0.00 0.00 0.00 23.81 40.91 50.39 64.83 96.33 176.85 204.14 261.40 262.17 268.96 298.49 309.99 315.49 316.45 318.48 329.65 335.54 363.33 372.71 389.59 423.08 426.08 432.17 487.05 496.11 509.60 559.41 748.49 772.75 858.29 887.71 959.07 959.25 972.05 972.50 1000.68 1001.07 1061.27 1070.68 1089.74 1092.07 1096.68 1097.55 1267.06 1269.46 1293.69 1298.95 1300.23 1301.70 1320.90 1438.40 1450.41 1457.12 1457.91 1462.01 1468.92 1485.80 1488.61 1529.52 1529.75 1537.39 1538.65 1541.86 1542.15 1559.48 1560.84 1561.41 1562.42 1574.50 1575.59 3102.52 3105.33 3109.72 3110.67 3116.96 3118.62 3181.10 3184.02 3191.94 3193.69 3198.78 3199.62 3201.97 3203.05 3206.82 3208.57 3212.50 3215.68 3664.79 3672.40
frequency: 23.81 40.91 50.39 64.83 96.33 176.85 204.14 261.40 262.17 268.96 298.49 309.99 315.49 316.45 318.48 329.65 335.54 363.33 372.71 389.59 423.08 426.08 432.17 487.05 496.11 509.60 559.41 748.49 772.75 858.29 887.71 959.07 959.25 972.05 972.50 1000.68 1001.07 1061.27 1070.68 1089.74 1092.07 1096.68 1097.55 1267.06 1269.46 1293.69 1298.95 1300.23 1301.70 1320.90 1438.40 1450.41 1457.12 1457.91 1462.01 1468.92 1485.80 1488.61 1529.52 1529.75 1537.39 1538.65 1541.86 1542.15 1559.48 1560.84 1561.41 1562.42 1574.50 1575.59 3102.52 3105.33 3109.72 3110.67 3116.96 3118.62 3181.10 3184.02 3191.94 3193.69 3198.78 3199.62 3201.97 3203.05 3206.82 3208.57 3212.50 3215.68 3664.79 3672.40
formula: C8H20N2OSi
InChI: InChI=1/C8H20N2OSi/c1-7(2,3)9-12(11)10-8(4,5)6/h9-10H,1-6H3
32 atoms
N  1.355821 0.006105 0.543251
Si 0.008936 -0.102618 -0.478225
N  -1.371183 0.147619 0.471759
C  -2.771421 0.130732 0.024534
C  -3.654375 0.139901 1.269787
C  -3.04385 -1.138393 -0.779947
C  -3.067591 1.362925 -0.831926
O  0.040787 -0.373534 -1.97825
C  2.768605 -0.101851 0.146686
C  3.072322 0.903078 -0.963424
C  3.076338 -1.519265 -0.338003
C  3.617974 0.221902 1.374161
H  1.213724 -0.039461 1.540322
H  -1.251706 0.544511 1.391341
H  -3.46088 -0.731272 1.898362
H  -3.491238 1.037939 1.872271
H  -4.708944 0.124323 0.994317
H  -2.840928 -2.026882 -0.180115
H  -4.088553 -1.172913 -1.091839
H  -2.424945 -1.180188 -1.675863
H  -2.873668 2.281662 -0.275562
H  -4.110234 1.380027 -1.153925
H  -2.440512 1.366469 -1.724519
H  2.475153 0.700185 -1.852457
H  4.124181 0.851825 -1.248517
H  2.861705 1.920796 -0.631165
H  4.127964 -1.623298 -0.611422
H  2.475909 -1.764851 -1.214958
H  2.858953 -2.253641 0.439837
H  4.679668 0.161817 1.135609
H  3.414882 1.229829 1.740645
H  3.427205 -0.483578 2.187034
totalener: -789.79747518 hartree
nucrepener: 880.04206437 hartree
electener: -1669.83953954 hartree
oneelecener: -2829.15790556 hartree
twoeener: 1159.31836602 hartree
kineticenergy: 785.11113226 hartree
exchangeener: -50.524585003230 hartree
correlationener: -4.594787984051 hartree
xcener: -55.119372987281 hartree
energy: -1816.7944 -528.1757 -398.2016 -398.1863 -285.4527 -285.4459 -283.9064 -283.9008 -283.5403 -283.4972 -283.4693 -283.4613 -150.5746 -104.2063 -104.0642 -104.0183 -27.5598 -27.0304 -26.5369 -23.6325 -23.1960 -21.1330 -21.1318 -20.8747 -20.8515 -17.6773 -16.9956 -15.9080 -15.1529 -14.7097 -14.1773 -13.8050 -13.7701 -13.2041 -12.9837 -12.3067 -12.1950 -12.0550 -11.7421 -11.6639 -11.3563 -11.3347 -11.1540 -10.7698 -10.6782 -10.5123 -10.3835 -10.0820 -9.5716 -8.3444 -8.0882 -7.9319 1.3232 1.8962 3.2492 3.4422 3.7618 4.4446 4.5443 5.0521 5.0905 5.2650 5.3855 5.4252 5.5029 5.9869 6.0594 6.0989 6.1576 6.3535 6.3614 6.5564 6.6442 6.7595 6.8361 7.0107 7.1015 7.4364 7.6059 7.7372 7.9040 8.1451 8.3402 9.0975 10.5214 12.4937 13.0607 13.4759 13.6107 14.2709 14.4303 14.4451 14.7077 15.1073 15.1928 15.2073 15.8989 16.7774 16.8806 17.0176 17.4955 17.5402 18.1475 18.3542 19.0336 19.6323 19.7271 19.8921 20.1202 20.3315 20.7131 21.6269 21.6551 22.4069 22.5602 23.2450 25.4720 26.5273 26.8623 26.9495 27.3393 27.4498 27.6403 27.7937 27.8570 27.9449 28.1363 28.1682 28.2731 28.3741 28.5646 28.6109 28.9708 29.0685 29.1296 29.4209 29.5551 30.0304 30.1031 30.8564 30.9088 30.9650 32.5044 33.1191 33.6134 34.8928 36.8740 37.8319 38.2739 38.5085 39.3428 39.7123 40.1166 40.1696 40.3426 40.9172 44.4025 45.0708 46.2135 46.8673 48.9299 48.9382 49.5680 49.8103 50.1278 50.3577 51.9397 52.0199 52.0623 52.2903 52.3713 52.4421 53.2745 54.6839 55.3736 56.4196 57.2362 57.8753 58.2249 58.2724 58.7536 59.0641 59.6972 59.9022 60.8340 61.3318 62.5029 62.6975 62.8339 63.3206 63.3509 63.4867 63.5492 63.6267 63.7075 63.9379 64.4523 65.5222 65.7394 66.2879 66.8402 72.5869 72.8188 73.8064 74.4740 75.1275 75.2314 75.3046 76.6650 76.6985 77.8791 80.2801 369.5316 369.8995 377.7134 377.7646 377.8470 377.9203 384.1509 384.1783 523.3110 523.8422 697.1838 electronvolt
chargesum: -0.0000000
charge: -0.759931 1.053689 -0.756412 0.102629 -0.644583 -0.648367 -0.616225 -0.659998 0.106272 -0.643954 -0.622155 -0.648443 0.346020 0.344563 0.225845 0.208257 0.226254 0.214507 0.212513 0.270911 0.205560 0.208128 0.250347 0.266993 0.212086 0.213436 0.207817 0.255875 0.206277 0.227586 0.223942 0.210560
charge: -0.373761 0.532644 -0.372487 -0.027255 -0.352788 -0.355935 -0.354231 -0.480405 -0.026258 -0.355791 -0.355401 -0.353196 0.251088 0.250857 0.129877 0.121841 0.134448 0.127611 0.127373 0.153132 0.123146 0.125438 0.143270 0.151334 0.127130 0.126907 0.125143 0.145877 0.123547 0.135037 0.128889 0.122919
qa: -0.7599 1.0537 -0.7564 0.1026 -0.6446 -0.6484 -0.6162 -0.6600 0.1063 -0.6440 -0.6222 -0.6484 0.3460 0.3446 0.2258 0.2083 0.2263 0.2145 0.2125 0.2709 0.2056 0.2081 0.2503 0.2670 0.2121 0.2134 0.2078 0.2559 0.2063 0.2276 0.2239 0.2106
va: 2.8763 4.2131 2.8785 3.7998 3.6970 3.6593 3.6721 2.0695 3.7965 3.6606 3.6681 3.6985 0.8493 0.8502 0.9129 0.9190 0.9152 0.9188 0.9165 0.9115 0.9216 0.9170 0.9111 0.9122 0.9165 0.9191 0.9171 0.9113 0.9214 0.9150 0.9133 0.9180
dispersion: -0.019482325 hartree
energy: -789.769982714745 hartree
dipole: -0.09310 0.05062 -0.04248 0.94009 -0.58839 0.35170 4.48035 -2.58065 1.89969
magnitude: 1.93244 au
magnitude: 4.91188 debye
temp: 298.15 k
press: 1.00 atm
zeropoint: 0.29057206 hartree
thermalvibcorrection: 0.01306179 hartree
thermalrotcorrection: 0.00141627 hartree
thermaltrasncorrection: 0.00141627 hartree
thermaltotal: -789.46351632 hartree
thermalcorr: 0.01589434 hartree
nonthermalcorr: 0.29057206 hartree
totalcorr: 0.30646639 hartree
thermalcorrenthalpy: 0.00094421 hartree
totalenthalpy: -789.46257211 hartree
vibrat: 0.02257799 hartree
rotat: 0.01501191 hartree
transl: 0.01976791 hartree
total: 0.05735781 hartree
totalentropycorr: -0.05735781 hartree
gibbsenthalpy: -789.51992992 hartree
gibbsminuselec: 0.25005279 hartree
