program: Orca
programVersion: 5.0.4
elementType: N Si N C C C C O C C C C H H H H H H H H H H H H H H H H H H H H
charge: 0
multiplicity: 1
keywords: Opt RIJCOSX PBEh-3c
formula: C8H20N2OSi
InChI: InChI=1/C8H20N2OSi/c1-7(2,3)9-12(11)10-8(4,5)6/h9-10H,1-6H3
32 atoms
N  1.355821 0.006105 0.543251
Si 0.008937 -0.102618 -0.478225
N  -1.371183 0.147619 0.471759
C  -2.771421 0.130732 0.024534
C  -3.654375 0.139901 1.269787
C  -3.04385 -1.138394 -0.779947
C  -3.067591 1.362925 -0.831926
O  0.040787 -0.373534 -1.97825
C  2.768605 -0.101851 0.146686
C  3.072322 0.903078 -0.963424
C  3.076338 -1.519265 -0.338003
C  3.617974 0.221902 1.374161
H  1.213724 -0.039461 1.540322
H  -1.251706 0.544511 1.391341
H  -3.46088 -0.731272 1.898362
H  -3.491238 1.037939 1.872271
H  -4.708944 0.124323 0.994317
H  -2.840928 -2.026882 -0.180115
H  -4.088553 -1.172913 -1.091839
H  -2.424945 -1.180188 -1.675863
H  -2.873668 2.281662 -0.275562
H  -4.110234 1.380027 -1.153925
H  -2.440512 1.366469 -1.724519
H  2.475153 0.700185 -1.852457
H  4.124181 0.851825 -1.248517
H  2.861705 1.920796 -0.631165
H  4.127964 -1.623298 -0.611422
H  2.475909 -1.764851 -1.214958
H  2.858953 -2.253641 0.439837
H  4.679668 0.161817 1.135609
H  3.414882 1.229829 1.740645
H  3.427205 -0.483578 2.187034
totalener: -789.79745978 hartree
nucrepener: 880.02085340 hartree
electener: -1669.81831318 hartree
oneelecener: -2829.11537467 hartree
twoeener: 1159.29706149 hartree
kineticenergy: 785.10943424 hartree
exchangeener: -50.524339541509 hartree
correlationener: -4.594747348460 hartree
xcener: -55.119086889969 hartree
dispersion: -0.019482430 hartree
dispersion: -0.019482900 hartree
dispersion: -0.019484165 hartree
dispersion: -0.019483351 hartree
dispersion: -0.019482550 hartree
energy: -1816.7943 -528.1754 -398.2016 -398.1864 -285.4526 -285.4458 -283.9064 -283.9008 -283.5404 -283.4973 -283.4695 -283.4614 -150.5745 -104.2061 -104.0641 -104.0182 -27.5598 -27.0304 -26.5367 -23.6325 -23.1960 -21.1330 -21.1318 -20.8748 -20.8515 -17.6773 -16.9956 -15.9080 -15.1529 -14.7097 -14.1773 -13.8050 -13.7701 -13.2041 -12.9837 -12.3067 -12.1951 -12.0550 -11.7421 -11.6639 -11.3563 -11.3348 -11.1540 -10.7698 -10.6782 -10.5123 -10.3835 -10.0819 -9.5716 -8.3442 -8.0881 -7.9319 1.3233 1.8962 3.2492 3.4422 3.7618 4.4446 4.5443 5.0521 5.0905 5.2650 5.3855 5.4252 5.5029 5.9869 6.0594 6.0990 6.1576 6.3535 6.3613 6.5564 6.6442 6.7595 6.8361 7.0107 7.1016 7.4364 7.6059 7.7372 7.9040 8.1451 8.3402 9.0975 10.5215 12.4937 13.0607 13.4759 13.6107 14.2709 14.4303 14.4451 14.7077 15.1073 15.1928 15.2073 15.8989 16.7774 16.8805 17.0176 17.4955 17.5403 18.1475 18.3542 19.0336 19.6323 19.7271 19.8921 20.1203 20.3315 20.7131 21.6269 21.6551 22.4069 22.5602 23.2450 25.4720 26.5273 26.8623 26.9495 27.3393 27.4498 27.6403 27.7937 27.8570 27.9449 28.1363 28.1682 28.2731 28.3741 28.5646 28.6109 28.9708 29.0685 29.1296 29.4209 29.5551 30.0304 30.1031 30.8564 30.9088 30.9650 32.5044 33.1191 33.6134 34.8928 36.8740 37.8319 38.2739 38.5085 39.3428 39.7123 40.1166 40.1696 40.3426 40.9172 44.4025 45.0707 46.2135 46.8673 48.9298 48.9381 49.5680 49.8103 50.1278 50.3577 51.9397 52.0199 52.0623 52.2903 52.3713 52.4421 53.2746 54.6840 55.3737 56.4196 57.2362 57.8753 58.2249 58.2724 58.7536 59.0642 59.6972 59.9022 60.8339 61.3319 62.5029 62.6975 62.8338 63.3206 63.3509 63.4867 63.5492 63.6267 63.7075 63.9379 64.4523 65.5222 65.7394 66.2879 66.8403 72.5869 72.8188 73.8064 74.4740 75.1275 75.2314 75.3046 76.6651 76.6985 77.8791 80.2802 369.5316 369.8995 377.7134 377.7645 377.8469 377.9203 384.1509 384.1783 523.3110 523.8422 697.1841 electronvolt
chargesum: -0.0000000
charge: -0.759929 1.053679 -0.756409 0.102624 -0.644578 -0.648361 -0.616218 -0.660004 0.106269 -0.643945 -0.622146 -0.648443 0.346024 0.344566 0.225844 0.208258 0.226253 0.214506 0.212511 0.270909 0.205561 0.208125 0.250345 0.266990 0.212082 0.213435 0.207817 0.255872 0.206276 0.227587 0.223942 0.210560
charge: -0.373757 0.532640 -0.372485 -0.027260 -0.352786 -0.355931 -0.354226 -0.480412 -0.026263 -0.355785 -0.355395 -0.353195 0.251090 0.250859 0.129877 0.121842 0.134447 0.127611 0.127372 0.153130 0.123146 0.125437 0.143268 0.151332 0.127129 0.126907 0.125142 0.145874 0.123546 0.135037 0.128890 0.122918
qa: -0.7599 1.0537 -0.7564 0.1026 -0.6446 -0.6484 -0.6162 -0.6600 0.1063 -0.6439 -0.6221 -0.6484 0.3460 0.3446 0.2258 0.2083 0.2263 0.2145 0.2125 0.2709 0.2056 0.2081 0.2503 0.2670 0.2121 0.2134 0.2078 0.2559 0.2063 0.2276 0.2239 0.2106
va: 2.8763 4.2131 2.8785 3.7998 3.6970 3.6593 3.6721 2.0695 3.7965 3.6606 3.6681 3.6985 0.8493 0.8502 0.9129 0.9190 0.9152 0.9188 0.9165 0.9115 0.9216 0.9170 0.9111 0.9122 0.9165 0.9191 0.9171 0.9113 0.9214 0.9150 0.9133 0.9180
dispersion: -0.019482325 hartree
energy: -789.769982709435 hartree
dipole: -0.09310 0.05064 -0.04247 0.94009 -0.58834 0.35175 4.48035 -2.58058 1.89977
magnitude: 1.93253 au
magnitude: 4.91209 debye
