program: Orca
programVersion: 5.0.4
elementType: N C C C C Si F N C C C C C C C C H H H H H H H H H H H H H H H H H H H H H H H H H H H H
charge: 1
multiplicity: 1
keywords: Opt RIJCOSX PBEh-3c
formula: C12H28FN2Si
InChI: InChI=1/C12H28FN2Si/c1-10(2,3)14-16(13)15(11(4,5)6)12(7,8)9/h14H,1-9H3
44 atoms
N  1.751816 0.09933 0.034477
C  3.12814 0.319176 0.575883
C  3.363877 -0.578362 1.786115
C  4.097722 -0.0559 -0.541231
C  3.291267 1.790094 0.943995
Si 0.2602 0.184155 0.730735
F  0.311538 0.530303 2.275593
N  -1.177633 -0.08572 -0.053163
C  -1.571705 -1.515564 -0.245052
C  -3.061378 -1.757636 -0.031895
C  -1.142256 -2.008525 -1.626053
C  -0.814655 -2.311124 0.82382
C  -1.934924 1.132519 -0.473266
C  -0.960603 2.305206 -0.31185
C  -3.142677 1.391977 0.429008
C  -2.356084 1.066178 -1.937096
H  1.736066 -0.082808 -0.961505
H  2.713958 -0.32888 2.624525
H  4.388726 -0.461224 2.137245
H  3.221732 -1.629756 1.533378
H  3.992131 -1.102433 -0.831786
H  5.124094 0.086426 -0.20714
H  3.958124 0.569011 -1.425917
H  4.305666 1.981719 1.293435
H  3.111994 2.436616 0.084194
H  2.614792 2.086246 1.747457
H  -3.256467 -2.827242 -0.112376
H  -3.680443 -1.270957 -0.783231
H  -3.392063 -1.437189 0.955241
H  -1.368496 -3.069009 -1.739297
H  -1.650518 -1.482242 -2.430699
H  -0.066833 -1.888178 -1.772515
H  0.280606 -2.227351 0.724687
H  -1.11789 -2.034285 1.836051
H  -1.00022 -3.380368 0.719717
H  -0.095639 2.235986 -0.97711
H  -0.628491 2.450464 0.730038
H  -1.449705 3.249399 -0.552376
H  -3.940097 0.669677 0.280248
H  -2.863046 1.376897 1.483023
H  -3.561741 2.37444 0.210455
H  -2.826581 2.007729 -2.221784
H  -1.504803 0.908784 -2.599591
H  -3.087604 0.282423 -2.124286
totalener: -971.08832357 hartree
nucrepener: 1462.52980019 hartree
electener: -2433.61812376 hartree
oneelecener: -4215.36020360 hartree
twoeener: 1781.74207984 hartree
kineticenergy: 964.81173364 hartree
exchangeener: -64.529553722551 hartree
correlationener: -5.988700078401 hartree
xcener: -70.518253800952 hartree
dispersion: -0.030647809 hartree
dispersion: -0.030650478 hartree
dispersion: -0.030653139 hartree
dispersion: -0.030650532 hartree
dispersion: -0.030648177 hartree
energy: -1823.6032 -687.6944 -403.0673 -402.6885 -289.5314 -289.5030 -289.2971 -288.0699 -287.9287 -287.2250 -287.2100 -287.1800 -287.1444 -287.0574 -287.0517 -287.0449 -157.1466 -110.8102 -110.6601 -110.5709 -40.5239 -32.0450 -31.4695 -28.7938 -27.4645 -26.8256 -25.3177 -24.9395 -24.7364 -24.5610 -24.4515 -24.4031 -21.8832 -21.8685 -21.0989 -20.2329 -19.5601 -19.0589 -18.9372 -18.3412 -18.2729 -18.1888 -17.8741 -17.6307 -17.3463 -17.0787 -16.9692 -16.7656 -16.5414 -16.1949 -15.8288 -15.6589 -15.4268 -15.3825 -15.2311 -15.1912 -15.1490 -15.0582 -14.9762 -14.8054 -14.6534 -14.3702 -14.2026 -14.1154 -13.8979 -13.8479 -12.8967 -12.0768 -3.8806 -3.3343 -1.1606 -0.9831 -0.2834 0.2573 0.6111 0.6761 1.0037 1.0668 1.2613 1.4764 1.4930 1.5915 1.6817 1.9265 2.0562 2.1157 2.2371 2.3398 2.4310 2.6206 2.6510 2.8327 2.9240 3.1021 3.1434 3.3055 3.3723 3.4029 3.5730 3.7180 3.7352 3.9413 3.9837 4.1030 4.2201 4.3962 4.5374 4.6550 4.9055 5.0169 5.0493 5.9138 6.6823 8.3608 8.9055 9.4198 9.4251 9.7617 10.0237 10.6384 10.7238 10.9556 11.0890 11.2730 11.4459 11.5401 11.8052 12.3428 12.4001 12.7022 13.0966 13.2188 13.5374 13.6749 13.8856 14.0689 14.6744 14.8077 15.0381 15.3958 15.6131 16.2417 16.2981 16.6138 17.0893 17.4608 18.3675 18.4714 18.5916 18.7247 19.0493 19.5950 19.9054 20.1600 20.5632 21.2499 21.9760 22.5142 22.9764 23.3186 23.5023 23.6920 23.8600 24.0707 24.2686 24.3964 24.6643 24.7277 24.8102 24.9184 24.9480 25.0500 25.3527 25.4177 25.5289 25.7070 25.7510 25.9791 26.0925 26.4063 26.7934 26.9525 27.2629 27.2774 27.7409 27.8679 28.1061 28.3291 28.7464 29.2780 29.6684 29.9417 30.3736 31.1007 31.4807 32.0342 32.7378 33.3743 33.6729 34.0924 34.3617 35.4573 35.5963 35.9147 36.5467 36.8673 37.0109 37.0714 38.5727 38.8760 39.4797 40.4048 41.3163 41.5577 42.2132 43.3013 43.8247 44.9576 45.0556 45.3311 45.3560 45.7705 46.3056 46.7093 47.1988 47.3826 47.8291 48.0703 48.4777 48.6528 49.0819 49.1830 49.5790 49.8948 51.4573 52.3063 52.5247 52.8490 53.0848 53.8551 54.3216 54.6211 55.2823 55.5731 56.0080 56.4778 56.7875 57.0986 58.2235 58.9686 59.2782 59.3794 59.7514 59.7707 59.9343 59.9421 60.0302 60.1128 60.2604 60.3266 60.4435 60.6537 60.7923 61.2142 61.6377 62.0702 62.3674 65.0880 67.4270 67.9744 68.3386 68.8833 69.1706 70.3901 70.8107 71.0552 71.2902 71.3938 72.0293 72.7227 74.6936 74.9915 76.5146 78.2463 365.5672 366.2192 367.0696 373.8567 374.1592 374.2248 374.5002 374.6738 375.1803 379.7336 380.3764 381.3322 518.9382 523.8310 889.5612 electronvolt
chargesum: 1.0000000
charge: -0.712920 0.063861 -0.640971 -0.659966 -0.622212 1.292501 -0.400297 -0.555874 0.059136 -0.644270 -0.603182 -0.767138 0.067972 -0.798034 -0.616739 -0.629438 0.400597 0.240243 0.259890 0.233702 0.240866 0.263982 0.234146 0.257057 0.232045 0.231012 0.256997 0.241256 0.247095 0.248541 0.253554 0.202129 0.238560 0.278873 0.307791 0.264831 0.253783 0.320017 0.251552 0.235651 0.244104 0.255654 0.230981 0.242662
charge: -0.315360 -0.023933 -0.352084 -0.352146 -0.349190 0.756005 -0.183083 -0.226903 -0.014692 -0.345380 -0.346149 -0.362589 -0.012452 -0.366782 -0.348590 -0.345823 0.283635 0.138447 0.151638 0.136767 0.138538 0.154705 0.135531 0.149965 0.136239 0.134664 0.150171 0.136030 0.142065 0.145771 0.142614 0.122566 0.142856 0.155308 0.169640 0.149490 0.150987 0.174566 0.142553 0.137990 0.144262 0.149803 0.135345 0.137003
qa: -0.7129 0.0639 -0.6410 -0.6600 -0.6222 1.2925 -0.4003 -0.5559 0.0591 -0.6443 -0.6032 -0.7671 0.0680 -0.7980 -0.6167 -0.6294 0.4006 0.2402 0.2599 0.2337 0.2409 0.2640 0.2341 0.2571 0.2320 0.2310 0.2570 0.2413 0.2471 0.2485 0.2536 0.2021 0.2386 0.2789 0.3078 0.2648 0.2538 0.3200 0.2516 0.2357 0.2441 0.2557 0.2310 0.2427
va: 3.0011 3.7452 3.6502 3.6641 3.6544 3.9252 1.0732 2.9943 3.7761 3.6509 3.6447 3.6018 3.7763 3.6024 3.6342 3.6478 0.8106 0.9138 0.9017 0.9111 0.9065 0.9027 0.9096 0.9022 0.9118 0.9144 0.9008 0.9113 0.9044 0.9036 0.9043 0.9248 0.9107 0.8885 0.8865 0.8961 0.8969 0.8820 0.9062 0.9122 0.9045 0.9010 0.9119 0.9113
dispersion: -0.030648032 hartree
energy: -971.053118843609 hartree
dipole: -1.15563 1.30301 0.14737 -2.23002 2.16985 -0.06017 -9.88235 9.26694 -0.61541
magnitude: 0.63567 au
magnitude: 1.61573 debye
