program: Orca
programVersion: 5.0.4
elementType: N C C C C Si N C C C C C C C C H H H H H H H H H H H H H H H H H H H H H H H H H H H H
charge: 2
multiplicity: 1
keywords: Freq RIJCOSX PBEh-3c
frequency: 0.00 0.00 0.00 0.00 0.00 0.00 33.84 50.07 61.73 76.55 123.30 145.82 165.49 182.97 199.00 216.57 253.21 257.90 258.85 284.41 289.45 301.67 311.27 320.34 322.22 331.45 335.35 349.32 361.08 365.94 374.89 386.47 411.83 425.64 433.44 467.06 476.87 523.19 541.19 578.35 589.99 614.93 771.67 801.47 849.16 903.34 937.22 940.42 950.17 954.84 959.88 964.20 981.27 988.65 993.57 1001.70 1013.56 1032.41 1050.33 1069.59 1071.68 1077.53 1084.54 1200.25 1214.06 1229.37 1231.30 1266.72 1288.02 1293.01 1295.98 1299.13 1341.66 1378.63 1419.92 1421.38 1443.15 1458.16 1460.46 1463.86 1466.71 1467.81 1485.54 1493.29 1496.64 1509.18 1514.96 1516.38 1521.24 1526.04 1527.18 1532.55 1546.02 1547.48 1548.57 1552.00 1553.02 1555.30 1559.66 1564.03 1569.11 2559.79 2677.78 3059.61 3115.28 3118.12 3127.32 3130.50 3131.99 3134.96 3137.98 3141.03 3153.83 3178.32 3203.21 3203.86 3208.83 3214.09 3220.93 3221.44 3222.86 3223.84 3226.17 3227.97 3229.60 3240.31 3246.24 3263.62 3619.74
frequency: 33.84 50.07 61.73 76.55 123.30 145.82 165.49 182.97 199.00 216.57 253.21 257.90 258.85 284.41 289.45 301.67 311.27 320.34 322.22 331.45 335.35 349.32 361.08 365.94 374.89 386.47 411.83 425.64 433.44 467.06 476.87 523.19 541.19 578.35 589.99 614.93 771.67 801.47 849.16 903.34 937.22 940.42 950.17 954.84 959.88 964.20 981.27 988.65 993.57 1001.70 1013.56 1032.41 1050.33 1069.59 1071.68 1077.53 1084.54 1200.25 1214.06 1229.37 1231.30 1266.72 1288.02 1293.01 1295.98 1299.13 1341.66 1378.63 1419.92 1421.38 1443.15 1458.16 1460.46 1463.86 1466.71 1467.81 1485.54 1493.29 1496.64 1509.18 1514.96 1516.38 1521.24 1526.04 1527.18 1532.55 1546.02 1547.48 1548.57 1552.00 1553.02 1555.30 1559.66 1564.03 1569.11 2559.79 2677.78 3059.61 3115.28 3118.12 3127.32 3130.50 3131.99 3134.96 3137.98 3141.03 3153.83 3178.32 3203.21 3203.86 3208.83 3214.09 3220.93 3221.44 3222.86 3223.84 3226.17 3227.97 3229.60 3240.31 3246.24 3263.62 3619.74
formula: C12H28N2Si
InChI: InChI=1/C12H28N2Si/c1-10(2,3)13-15-14(11(4,5)6)12(7,8)9/h13H,1-9H3
43 atoms
N  2.020978 0.2350 -0.906862
C  3.130084 0.0147 0.074197
C  4.065653 1.216172 0.061495
C  3.859794 -1.280196 -0.249169
C  2.379447 -0.071039 1.400312
Si 0.550894 -0.140777 -0.299228
N  -1.068995 0.038536 -0.170415
C  -1.729468 1.367079 0.095832
C  -2.782958 1.252521 1.187779
C  -2.333122 1.90429 -1.200327
C  -0.607283 2.292234 0.558449
C  -1.681149 -1.32992 -0.315045
C  -0.502476 -2.142396 -0.85193
C  -2.803599 -1.344754 -1.346296
C  -2.128544 -1.90056 1.025332
H  2.239289 0.497119 -1.863095
H  4.59027 1.287353 -0.891172
H  4.823733 1.102807 0.83592
H  3.535922 2.151772 0.23745
H  4.304172 -1.245383 -1.243542
H  4.669871 -1.442473 0.461033
H  3.201066 -2.15045 -0.205372
H  1.444528 -0.734236 1.316162
H  2.903789 -0.610986 2.19158
H  2.064295 0.898232 1.790969
H  -3.639625 0.655033 0.880766
H  -2.382125 0.852015 2.11856
H  -3.165441 2.25017 1.402171
H  -1.598364 1.955398 -2.005017
H  -3.182704 1.320331 -1.544768
H  -2.698102 2.916818 -1.028477
H  0.163476 2.444715 -0.20999
H  -0.155762 1.955279 1.497829
H  -0.992719 3.29237 0.758561
H  0.41531 -2.06527 -0.178043
H  -0.238077 -1.928089 -1.894165
H  -0.632019 -3.226556 -0.780407
H  -3.683968 -0.820227 -0.981202
H  -2.501083 -0.905396 -2.295812
H  -3.106831 -2.375161 -1.532065
H  -2.430859 -2.939933 0.8963
H  -2.98524 -1.371396 1.429978
H  -1.33216 -1.874544 1.771825
totalener: -870.90282014 hartree
nucrepener: 1298.02089228 hartree
electener: -2168.92371242 hartree
oneelecener: -3728.61476682 hartree
twoeener: 1559.69105440 hartree
kineticenergy: 865.42620941 hartree
exchangeener: -58.688678590204 hartree
correlationener: -5.521603919030 hartree
xcener: -64.210282509234 hartree
energy: -1828.2959 -407.9333 -407.7453 -293.9543 -293.8308 -293.3497 -293.2100 -293.1131 -291.3301 -290.9454 -290.9402 -290.8734 -290.7817 -290.4625 -290.4418 -161.9481 -115.5522 -115.5136 -115.3177 -36.8114 -36.2876 -32.9946 -31.8965 -30.8626 -30.1624 -29.6936 -28.5316 -28.4152 -28.3288 -27.8367 -26.0226 -25.7912 -25.7085 -24.1350 -23.3538 -23.0431 -22.7769 -22.4583 -22.1478 -21.3416 -21.1901 -21.0478 -20.9075 -20.7932 -20.4592 -20.1835 -20.0278 -19.5476 -19.2126 -19.0015 -18.9713 -18.9015 -18.8102 -18.7215 -18.4439 -18.4248 -18.3751 -18.3058 -18.0220 -17.7878 -17.5763 -17.2307 -16.7056 -10.1484 -8.4190 -8.0256 -5.7204 -5.1912 -4.0598 -3.7715 -3.3849 -3.1674 -3.0897 -2.7801 -2.6290 -2.3633 -2.2496 -2.1124 -1.9061 -1.8736 -1.5756 -1.5572 -1.5015 -1.3155 -1.2430 -1.0505 -0.8930 -0.8286 -0.7284 -0.5696 -0.5480 -0.3920 -0.2596 -0.1205 -0.0550 0.0468 0.1295 0.4026 0.5180 0.5333 0.6707 0.8381 1.1373 1.2326 1.4144 1.9564 2.0996 2.5225 3.7868 4.6047 5.1883 5.4725 5.7829 6.1027 6.2470 6.5678 6.6667 6.8543 7.2499 7.6657 7.8593 8.0173 8.3583 8.8566 8.9554 9.1938 9.3463 9.5653 9.7781 10.0416 10.2865 10.5924 10.7730 11.0596 11.2888 11.5407 11.8779 12.4372 12.8266 13.1399 13.6083 13.6620 14.2428 14.3128 14.5090 15.4223 15.5516 15.8487 16.1887 17.0261 17.2765 17.7897 17.9416 18.9545 19.2185 19.6261 19.9621 20.0678 20.4205 20.5265 20.6965 21.0447 21.1005 21.3102 21.3974 21.5070 21.6305 21.7999 21.8232 21.9602 22.0352 22.4425 22.6105 22.7342 22.8944 23.1562 23.6020 23.7860 24.0196 24.2816 24.6271 24.9157 25.1436 25.5660 26.0833 26.5291 26.8744 27.2526 28.9592 30.2085 30.6858 31.2130 31.6770 31.8926 32.5499 32.6450 33.5951 34.7481 34.8189 35.2435 36.9324 37.2281 37.9629 38.6596 38.9803 40.1197 40.8146 40.9982 41.4359 41.4914 41.7858 42.8163 42.9673 43.1800 43.3531 44.4636 44.5920 44.8239 45.1001 45.4261 45.9100 46.0724 47.9684 48.5509 48.8198 49.0027 49.2009 49.7709 50.0904 50.7180 51.4433 51.5749 52.0864 52.3911 52.7759 53.0528 54.0218 54.5552 54.8040 55.1225 55.7358 55.8267 55.9483 56.1679 56.2504 56.3982 56.6078 56.7675 56.9046 56.9610 57.2393 57.4412 58.1831 60.0820 60.8887 63.6213 63.9945 64.2542 64.7991 65.1646 66.4451 66.5812 66.9688 67.3226 67.5670 67.8105 68.5871 68.9212 70.9092 72.4420 361.1660 362.3908 363.1850 369.6939 370.0219 370.2356 370.6032 371.0663 371.7233 375.9329 376.3235 377.5636 515.5825 517.9554 electronvolt
chargesum: 2.0000000
charge: -0.652335 0.019610 -0.621171 -0.600507 -0.748207 1.049190 -0.459454 0.023260 -0.636714 -0.611072 -0.750678 0.024367 -0.804739 -0.633818 -0.607871 0.433332 0.278267 0.287559 0.255077 0.280076 0.288682 0.220930 0.186702 0.387672 0.336156 0.253311 0.249772 0.294130 0.231319 0.267324 0.286686 0.252975 0.251493 0.346454 0.241023 0.344540 0.403810 0.277759 0.258877 0.292040 0.284359 0.292027 0.227787
charge: -0.301286 -0.023365 -0.339769 -0.343126 -0.292339 0.786013 -0.150236 -0.014835 -0.343580 -0.340784 -0.360740 -0.010522 -0.312324 -0.337132 -0.341086 0.307847 0.162427 0.171276 0.149782 0.162394 0.169662 0.133170 0.147257 0.208739 0.181024 0.144887 0.145202 0.170607 0.137484 0.151232 0.167473 0.146250 0.143139 0.189268 0.176133 0.190786 0.220537 0.159236 0.151089 0.170670 0.166071 0.164606 0.136864
qa: -0.6523 0.0196 -0.6212 -0.6005 -0.7482 1.0492 -0.4595 0.0233 -0.6367 -0.6111 -0.7507 0.0244 -0.8047 -0.6338 -0.6079 0.4333 0.2783 0.2876 0.2551 0.2801 0.2887 0.2209 0.1867 0.3877 0.3362 0.2533 0.2498 0.2941 0.2313 0.2673 0.2867 0.2530 0.2515 0.3465 0.2410 0.3445 0.4038 0.2778 0.2589 0.2920 0.2844 0.2920 0.2278
va: 3.0372 3.6879 3.6187 3.6124 3.4893 3.8573 3.1061 3.7216 3.6175 3.6118 3.5866 3.6927 3.4995 3.6109 3.5967 0.7943 0.8938 0.8875 0.9017 0.8943 0.8883 0.9140 0.9004 0.8400 0.8577 0.9060 0.9027 0.8862 0.9128 0.8984 0.8884 0.8982 0.8990 0.8662 0.8787 0.8483 0.8293 0.8972 0.8992 0.8838 0.8879 0.8914 0.9131
dispersion: -0.030069352 hartree
energy: -870.870098544144 hartree
dipole: -2.07359 3.26673 1.19314 -0.03731 -0.75934 -0.79665 2.87012 -3.00380 -0.13368
magnitude: 1.44087 au
magnitude: 3.66241 debye
temp: 298.15 k
press: 1.00 atm
zeropoint: 0.39871552 hartree
thermalvibcorrection: 0.01675530 hartree
thermalrotcorrection: 0.00141627 hartree
thermaltrasncorrection: 0.00141627 hartree
thermaltotal: -870.45179518 hartree
thermalcorr: 0.01958784 hartree
nonthermalcorr: 0.39871552 hartree
totalcorr: 0.41830336 hartree
thermalcorrenthalpy: 0.00094421 hartree
totalenthalpy: -870.45085097 hartree
vibrat: 0.02848796 hartree
rotat: 0.01546515 hartree
transl: 0.02004133 hartree
total: 0.06399444 hartree
totalentropycorr: -0.06399444 hartree
gibbsenthalpy: -870.51484541 hartree
gibbsminuselec: 0.35525313 hartree
