program: Orca
programVersion: 5.0.4
elementType: N C C C C Si N C C C C C C C C H H H H H H H H H H H H H H H H H H H H H H H H H H H H
charge: 2
multiplicity: 1
keywords: SP DSD-BLYP D3BJ def2-QZVPP def2-QZVPP/C def2/J TightSCF
formula: C12H28N2Si
InChI: InChI=1/C12H28N2Si/c1-10(2,3)13-15-14(11(4,5)6)12(7,8)9/h13H,1-9H3
43 atoms
N  1.956113 0.237174 -0.83132
C  3.065219 0.016874 0.149738
C  4.000788 1.218346 0.137036
C  3.794929 -1.278021 -0.173628
C  2.314582 -0.068865 1.475853
Si 0.486029 -0.138603 -0.223687
N  -1.133861 0.04071 -0.094874
C  -1.794333 1.369253 0.171373
C  -2.847823 1.254695 1.26332
C  -2.397987 1.906464 -1.124785
C  -0.672148 2.294408 0.63399
C  -1.746014 -1.327746 -0.239503
C  -0.567341 -2.140222 -0.776389
C  -2.868464 -1.34258 -1.270755
C  -2.193409 -1.898386 1.100873
H  2.174424 0.499293 -1.787554
H  4.525404 1.289527 -0.81563
H  4.758868 1.104981 0.911462
H  3.471057 2.153946 0.312991
H  4.239307 -1.243208 -1.168001
H  4.605006 -1.440299 0.536575
H  3.136201 -2.148276 -0.12983
H  1.379663 -0.732062 1.391703
H  2.838924 -0.608812 2.267122
H  1.99943 0.900406 1.86651
H  -3.70449 0.657207 0.956308
H  -2.446991 0.854189 2.194101
H  -3.230306 2.252344 1.477713
H  -1.663229 1.957572 -1.929475
H  -3.247569 1.322505 -1.469226
H  -2.762967 2.918992 -0.952935
H  0.098611 2.446889 -0.134448
H  -0.220628 1.957453 1.57337
H  -1.057585 3.294544 0.834102
H  0.350445 -2.063096 -0.102502
H  -0.302942 -1.925915 -1.818624
H  -0.696884 -3.224382 -0.704865
H  -3.748833 -0.818053 -0.90566
H  -2.565949 -0.903222 -2.22027
H  -3.171696 -2.372987 -1.456523
H  -2.495724 -2.937759 0.971841
H  -3.050105 -1.369222 1.505519
H  -1.397025 -1.872369 1.847367
totalener: -870.44003452 hartree
nucrepener: 1298.02089243 hartree
electener: -2168.46092694 hartree
oneelecener: -3729.17492689 hartree
twoeener: 1560.71399995 hartree
kineticenergy: 868.53277377 hartree
exchangeener: -32.706452952455 hartree
correlationener: -2.287799539394 hartree
xcener: -34.994252491849 hartree
chargesum: 2.0000000
charge: -0.494228 0.164811 -0.148951 -0.119978 -0.222311 1.089238 -0.343326 0.127022 -0.130886 -0.137670 -0.243898 0.162040 -0.291386 -0.146718 -0.139106 0.242938 0.092313 0.101824 0.078246 0.093084 0.103356 0.049974 0.046801 0.181476 0.142166 0.062337 0.066647 0.109357 0.052370 0.086128 0.104594 0.080226 0.083887 0.134746 0.105329 0.147158 0.187741 0.081466 0.078253 0.110110 0.096816 0.105538 0.050466
charge: 0.562340 -0.328501 0.289661 0.280050 0.335614 0.183540 0.423929 -0.320379 0.277047 0.278883 0.272106 -0.306535 0.337788 0.291908 0.287080 -0.125263 -0.034041 -0.027413 -0.043042 -0.033695 -0.028151 -0.049938 0.001028 0.003862 -0.014310 -0.046313 -0.044250 -0.025482 -0.048050 -0.046988 -0.027984 -0.033007 -0.038924 -0.014026 0.014933 0.001615 0.015918 -0.038166 -0.040226 -0.026483 -0.028813 -0.040823 -0.046499
qa: -0.4942 0.1648 -0.1490 -0.1200 -0.2223 1.0892 -0.3433 0.1270 -0.1309 -0.1377 -0.2439 0.1620 -0.2914 -0.1467 -0.1391 0.2429 0.0923 0.1018 0.0782 0.0931 0.1034 0.0500 0.0468 0.1815 0.1422 0.0623 0.0666 0.1094 0.0524 0.0861 0.1046 0.0802 0.0839 0.1347 0.1053 0.1472 0.1877 0.0815 0.0783 0.1101 0.0968 0.1055 0.0505
va: 3.1976 3.7728 3.8922 3.8895 3.8601 3.9447 2.9918 3.8630 3.8728 3.8930 3.8864 3.8257 3.8691 3.8955 3.8973 0.9895 0.9963 0.9985 0.9968 1.0009 1.0018 0.9998 0.9945 0.9662 0.9957 1.0049 1.0037 0.9994 1.0015 0.9977 1.0035 0.9843 0.9949 0.9970 0.9874 0.9885 0.9604 1.0017 1.0011 0.9969 1.0035 0.9985 1.0033
total: -871.823171353 hartree
dispersion: -0.033101204 hartree
energy: -871.856272557145 hartree
dipole: -2.07359 3.32306 1.24947 -0.03731 -0.81925 -0.85656 2.87012 -2.93922 -0.06909
magnitude: 1.51646 au
magnitude: 3.85453 debye
