program: Orca
programVersion: 5.0.4
elementType: N Si F N C C H H H H H H H H
charge: 1
multiplicity: 1
keywords: Freq RIJCOSX PBEh-3c
frequency: 0.00 0.00 0.00 0.00 0.00 0.00 48.44 80.49 152.20 261.31 267.52 314.81 342.01 399.72 419.99 552.55 613.43 762.51 827.87 851.61 946.75 1065.03 1111.89 1143.26 1173.62 1186.41 1332.21 1424.22 1475.92 1486.49 1538.93 1543.34 1560.43 1643.83 3129.38 3154.69 3201.77 3221.81 3226.89 3628.36 3638.00 3729.68
frequency: 48.44 80.49 152.20 261.31 267.52 314.81 342.01 399.72 419.99 552.55 613.43 762.51 827.87 851.61 946.75 1065.03 1111.89 1143.26 1173.62 1186.41 1332.21 1424.22 1475.92 1486.49 1538.93 1543.34 1560.43 1643.83 3129.38 3154.69 3201.77 3221.81 3226.89 3628.36 3638.00 3729.68
formula: C2H8FN2Si
InChI: InChI=1/C2H8FN2Si/c1-2-5-6(3)4/h5H,2,4H2,1H3
14 atoms
N  2.925522 0.423733 -0.376761
Si 1.566396 -0.298463 0.200824
F  1.669034 -1.835409 0.486645
N  0.138521 0.44052 0.498721
C  -1.127748 -0.201612 0.927164
C  -2.197056 -0.096801 -0.13945
H  3.790557 -0.079616 -0.52209
H  2.996123 1.401106 -0.621407
H  0.050862 1.43607 0.333237
H  -1.440761 0.279853 1.853143
H  -0.923274 -1.243987 1.168004
H  -2.437273 0.940628 -0.372884
H  -1.898493 -0.597012 -1.060073
H  -3.11241 -0.569011 0.214125
totalener: -578.76860742 hartree
nucrepener: 315.01681300 hartree
electener: -893.78542042 hartree
oneelecener: -1411.30709996 hartree
twoeener: 517.52167954 hartree
kineticenergy: 575.97855831 hartree
exchangeener: -31.709156496096 hartree
correlationener: -2.559151120236 hartree
xcener: -34.268307616332 hartree
energy: -1824.7814 -688.9986 -404.3338 -404.2838 -289.6944 -287.6794 -158.4531 -112.0665 -111.9925 -111.8931 -41.8724 -32.6837 -31.9937 -27.0984 -23.5724 -22.9928 -21.5720 -20.9378 -20.6078 -19.9981 -19.4226 -19.0143 -18.0136 -16.9538 -15.7224 -15.6391 -15.1770 -13.9753 -5.0048 -4.5067 -2.8181 -1.3555 -0.8053 0.2288 0.8160 1.1315 1.4429 1.5577 2.0848 2.2122 2.5071 3.2174 3.6105 6.0115 8.0955 8.4939 8.5996 9.0102 10.3879 10.5824 11.4204 11.5057 12.9298 13.5833 13.9731 15.2129 17.1435 17.3473 20.2249 20.3591 21.1129 21.6824 21.8664 22.9313 23.7448 23.8227 24.2733 24.7636 25.4059 25.4247 27.6925 28.2850 28.5872 29.2070 29.3713 30.6696 32.8828 33.9403 34.5500 35.1141 35.9795 36.8885 41.0350 41.7987 42.7586 43.3648 45.0862 46.3671 48.5967 50.0956 51.0840 51.7235 54.7010 56.4318 57.6625 58.3654 60.7505 62.2191 62.6580 64.0047 66.4585 67.7408 70.5162 76.6241 366.9317 375.3217 512.1953 514.9820 887.5394 electronvolt
chargesum: 1.0000000
charge: -0.885515 1.379778 -0.407859 -0.697617 -0.314003 -0.646340 0.437594 0.428132 0.409546 0.282839 0.261646 0.239175 0.238613 0.274010
charge: -0.471697 0.838896 -0.160432 -0.328253 -0.141883 -0.368680 0.303894 0.297753 0.291686 0.149541 0.146936 0.140938 0.140345 0.160953
qa: -0.8855 1.3798 -0.4079 -0.6976 -0.3140 -0.6463 0.4376 0.4281 0.4095 0.2828 0.2616 0.2392 0.2386 0.2740
va: 2.9507 3.7889 1.0633 3.0546 3.6250 3.6787 0.7908 0.7979 0.8039 0.8765 0.8927 0.9059 0.9064 0.8933
dispersion: -0.005924431 hartree
energy: -578.754239987298 hartree
dipole: -9.02272 9.95987 0.93714 5.21392 -3.97187 1.24205 -1.17997 0.84564 -0.33433
magnitude: 1.59145 au
magnitude: 4.04513 debye
temp: 298.15 k
press: 1.00 atm
zeropoint: 0.11722854 hartree
thermalvibcorrection: 0.00531900 hartree
thermalrotcorrection: 0.00141627 hartree
thermaltrasncorrection: 0.00141627 hartree
thermaltotal: -578.62885990 hartree
thermalcorr: 0.00815154 hartree
nonthermalcorr: 0.11722854 hartree
totalcorr: 0.12538008 hartree
thermalcorrenthalpy: 0.00094421 hartree
totalenthalpy: -578.62791569 hartree
vibrat: 0.00917003 hartree
rotat: 0.01316413 hartree
transl: 0.01896950 hartree
total: 0.04130366 hartree
totalentropycorr: -0.04130366 hartree
gibbsenthalpy: -578.66921935 hartree
gibbsminuselec: 0.08502064 hartree
