program: Orca
programVersion: 5.0.4
elementType: N Si F F N C C H H H H H H H H
charge: 0
multiplicity: 1
keywords: Freq RIJCOSX PBEh-3c
frequency: 0.00 0.00 0.00 0.00 0.00 0.00 34.08 65.72 157.00 224.02 236.66 275.24 312.58 338.42 351.93 399.55 420.61 455.21 524.99 743.53 823.16 835.40 903.27 967.61 982.10 1011.13 1127.84 1165.35 1210.29 1345.11 1429.28 1465.45 1500.85 1545.60 1548.43 1567.55 1658.22 3087.54 3115.25 3169.52 3197.14 3212.09 3676.26 3689.21 3787.57
frequency: 34.08 65.72 157.00 224.02 236.66 275.24 312.58 338.42 351.93 399.55 420.61 455.21 524.99 743.53 823.16 835.40 903.27 967.61 982.10 1011.13 1127.84 1165.35 1210.29 1345.11 1429.28 1465.45 1500.85 1545.60 1548.43 1567.55 1658.22 3087.54 3115.25 3169.52 3197.14 3212.09 3676.26 3689.21 3787.57
formula: C2H8F2N2Si
InChI: InChI=1/C2H8F2N2Si/c1-2-6-7(3,4)5/h6H,2,5H2,1H3
15 atoms
N  -2.693923 0.288767 0.456302
Si -1.527655 0.038038 -0.753456
F  -2.037223 0.87017 -2.035139
F  -1.383155 -1.464095 -1.320575
N  -0.00155 0.460592 -0.152048
C  1.284754 0.044755 -0.67692
C  2.235702 -0.401386 0.420343
H  -3.655213 0.486513 0.238477
H  -2.587771 -0.101754 1.37619
H  0.0489 1.254845 0.466654
H  1.747933 0.847289 -1.261407
H  1.125558 -0.779623 -1.372278
H  1.815908 -1.23743 0.979109
H  2.434832 0.407457 1.125954
H  3.193003 -0.714139 0.002595
totalener: -678.78766644 hartree
nucrepener: 419.17808317 hartree
electener: -1097.96574961 hartree
oneelecener: -1771.56653242 hartree
twoeener: 673.60078281 hartree
kineticenergy: 675.33064551 hartree
exchangeener: -37.542479910647 hartree
correlationener: -3.034916220937 hartree
xcener: -40.577396131584 hartree
energy: -1818.4602 -682.1430 -682.1242 -397.8498 -397.8334 -284.8429 -283.7007 -151.8877 -105.4797 -105.4487 -105.3994 -35.2656 -34.7056 -26.7871 -25.7627 -22.3532 -18.8259 -17.0351 -15.5764 -15.0679 -14.7291 -14.4507 -14.0983 -13.5054 -13.0473 -12.9024 -12.7083 -12.4989 -11.7611 -11.5023 -10.7226 -8.9476 -8.1007 2.6199 3.6418 4.1888 4.4848 4.7726 5.1601 5.6430 5.7773 5.9977 6.1849 6.2554 6.9617 7.4024 7.7302 9.0650 12.2976 13.2157 13.6038 14.0945 14.5179 15.0460 15.2721 16.4650 16.9181 18.3078 19.4478 20.3172 22.8023 23.2838 23.7575 25.6251 26.5857 26.8187 27.1284 27.3690 27.6185 28.0435 28.1649 28.5130 28.9985 29.3149 29.5975 31.5193 32.0955 33.5011 34.3087 34.7261 34.9584 35.3476 35.5324 36.0824 36.4158 37.1712 38.1232 38.9482 39.2791 40.2264 41.5760 42.3659 43.5624 44.3636 46.4417 47.1431 48.2438 49.6268 50.2497 50.8951 53.5441 54.9687 55.5455 56.4984 58.5719 60.4442 62.0972 62.7989 63.6689 65.3819 67.1108 68.2858 69.1951 71.6489 73.8025 76.1232 80.6033 81.8698 371.5456 379.7722 518.3174 521.7929 892.8793 893.0822 electronvolt
chargesum: 0.0000000
charge: -0.943806 1.368555 -0.467900 -0.470470 -0.739168 -0.259677 -0.640166 0.364211 0.360199 0.348832 0.207651 0.228423 0.224712 0.203751 0.214852
charge: -0.556920 0.600194 -0.249159 -0.249653 -0.395500 -0.153177 -0.372800 0.253312 0.251660 0.251952 0.108901 0.130849 0.130777 0.121070 0.128496
qa: -0.9438 1.3686 -0.4679 -0.4705 -0.7392 -0.2597 -0.6402 0.3642 0.3602 0.3488 0.2077 0.2284 0.2247 0.2038 0.2149
va: 2.8065 4.0618 0.9503 0.9461 2.9133 3.7539 3.7305 0.8407 0.8434 0.8452 0.8998 0.9080 0.9118 0.9166 0.9140
dispersion: -0.006357177 hartree
energy: -678.767566723607 hartree
dipole: 11.51712 -11.40301 0.11411 0.87584 -0.59397 0.28187 8.26362 -7.23767 1.02595
magnitude: 1.07007 au
magnitude: 2.71990 debye
temp: 298.15 k
press: 1.00 atm
zeropoint: 0.11974223 hartree
thermalvibcorrection: 0.00649298 hartree
thermalrotcorrection: 0.00141627 hartree
thermaltrasncorrection: 0.00141627 hartree
thermaltotal: -678.63849897 hartree
thermalcorr: 0.00932552 hartree
nonthermalcorr: 0.11974223 hartree
totalcorr: 0.12906775 hartree
thermalcorrenthalpy: 0.00094421 hartree
totalenthalpy: -678.63755476 hartree
vibrat: 0.01118879 hartree
rotat: 0.01354673 hartree
transl: 0.01920060 hartree
total: 0.04393613 hartree
totalentropycorr: -0.04393613 hartree
gibbsenthalpy: -678.68149090 hartree
gibbsminuselec: 0.08607583 hartree
