program: Orca
programVersion: 5.0.4
elementType: N Si F F N C C H H H H H H H H
charge: 0
multiplicity: 1
keywords: Opt RIJCOSX PBEh-3c
formula: C2H8F2N2Si
InChI: InChI=1/C2H8F2N2Si/c1-2-6-7(3,4)5/h6H,2,5H2,1H3
15 atoms
N  -2.693923 0.288767 0.456302
Si -1.527655 0.038038 -0.753456
F  -2.037223 0.87017 -2.035139
F  -1.383155 -1.464095 -1.320575
N  -0.00155 0.460592 -0.152048
C  1.284754 0.044755 -0.67692
C  2.235702 -0.401386 0.420343
H  -3.655213 0.486513 0.238477
H  -2.587771 -0.101754 1.37619
H  0.0489 1.254845 0.466654
H  1.747933 0.847289 -1.261407
H  1.125558 -0.779623 -1.372278
H  1.815908 -1.23743 0.979109
H  2.434832 0.407457 1.125954
H  3.193003 -0.714139 0.002595
totalener: -678.78767335 hartree
nucrepener: 419.10408600 hartree
electener: -1097.89175935 hartree
oneelecener: -1771.41396972 hartree
twoeener: 673.52221037 hartree
kineticenergy: 675.32869173 hartree
exchangeener: -37.542261407121 hartree
correlationener: -3.034893774710 hartree
xcener: -40.577155181830 hartree
dispersion: -0.006355378 hartree
dispersion: -0.006355749 hartree
dispersion: -0.006356978 hartree
energy: -1818.4598 -682.1520 -682.1299 -397.8522 -397.8209 -284.8449 -283.7005 -151.8874 -105.4794 -105.4483 -105.3991 -35.2685 -34.7086 -26.7877 -25.7584 -22.3535 -18.8262 -17.0360 -15.5750 -15.0668 -14.7308 -14.4517 -14.0988 -13.5067 -13.0485 -12.9052 -12.7090 -12.5014 -11.7615 -11.5025 -10.7230 -8.9436 -8.1015 2.6203 3.6422 4.1891 4.4848 4.7727 5.1602 5.6438 5.7775 5.9977 6.1851 6.2555 6.9616 7.4022 7.7298 9.0652 12.2975 13.2158 13.6036 14.0945 14.5177 15.0457 15.2720 16.4648 16.9178 18.3075 19.4485 20.3179 22.8021 23.2867 23.7573 25.6257 26.5858 26.8197 27.1295 27.3691 27.6191 28.0447 28.1651 28.5136 28.9984 29.3150 29.5984 31.5191 32.0953 33.4997 34.3073 34.7245 34.9567 35.3467 35.5323 36.0811 36.4148 37.1705 38.1218 38.9479 39.2797 40.2258 41.5746 42.3656 43.5622 44.3627 46.4419 47.1425 48.2430 49.6261 50.2492 50.8970 53.5437 54.9698 55.5464 56.4978 58.5724 60.4438 62.0997 62.7986 63.6690 65.3857 67.1104 68.2852 69.1975 71.6494 73.8018 76.1225 80.6014 81.8677 371.5449 379.7713 518.3279 521.7911 892.8737 893.0751 electronvolt
chargesum: -0.0000000
charge: -0.944251 1.368565 -0.467806 -0.470341 -0.739070 -0.259595 -0.640194 0.364310 0.360298 0.348767 0.207633 0.228390 0.224696 0.203744 0.214855
charge: -0.557281 0.600191 -0.249077 -0.249534 -0.395436 -0.153118 -0.372817 0.253390 0.251731 0.251912 0.108887 0.130828 0.130765 0.121063 0.128497
qa: -0.9443 1.3686 -0.4678 -0.4703 -0.7391 -0.2596 -0.6402 0.3643 0.3603 0.3488 0.2076 0.2284 0.2247 0.2037 0.2149
va: 2.8060 4.0618 0.9504 0.9463 2.9133 3.7539 3.7305 0.8406 0.8433 0.8453 0.8998 0.9080 0.9118 0.9166 0.9140
dispersion: -0.006357177 hartree
energy: -678.767566877479 hartree
dipole: 11.51712 -11.40287 0.11424 0.87584 -0.59415 0.28169 8.26362 -7.23832 1.02530
magnitude: 1.06941 au
magnitude: 2.71824 debye
