program: Orca
programVersion: 5.0.4
elementType: N Si N C C O H H H H H H H H
charge: 0
multiplicity: 1
keywords: Freq RIJCOSX PBEh-3c
frequency: 0.00 0.00 0.00 0.00 0.00 0.00 52.36 87.09 160.18 264.83 276.30 286.57 359.91 388.44 420.70 448.50 511.33 745.63 822.06 861.68 926.30 991.39 1121.62 1158.50 1199.50 1320.77 1342.18 1429.67 1466.65 1495.48 1544.05 1547.37 1560.01 1651.37 3105.66 3114.69 3176.13 3198.23 3209.34 3680.31 3696.31 3800.17
frequency: 52.36 87.09 160.18 264.83 276.30 286.57 359.91 388.44 420.70 448.50 511.33 745.63 822.06 861.68 926.30 991.39 1121.62 1158.50 1199.50 1320.77 1342.18 1429.67 1466.65 1495.48 1544.05 1547.37 1560.01 1651.37 3105.66 3114.69 3176.13 3198.23 3209.34 3680.31 3696.31 3800.17
formula: C2H8N2OSi
InChI: InChI=1/C2H8N2OSi/c1-2-4-6(3)5/h4H,2-3H2,1H3
14 atoms
N  2.828983 0.167251 0.60577
Si 1.52191 -0.622359 -0.118417
N  0.090231 -0.005985 0.533017
C  -1.240396 -0.443698 0.146552
C  -1.980667 0.576293 -0.703118
O  1.619143 -1.712779 -1.173336
H  2.770932 0.865775 1.324746
H  3.774228 -0.056572 0.348228
H  0.098673 0.775554 1.168905
H  -1.823167 -0.677802 1.042456
H  -1.139533 -1.377794 -0.40613
H  -1.442249 0.771468 -1.630513
H  -2.977089 0.215485 -0.961006
H  -2.100999 1.525262 -0.177354
totalener: -554.40456784 hartree
nucrepener: 304.34928496 hartree
electener: -858.75385280 hartree
oneelecener: -1366.99488364 hartree
twoeener: 508.24103084 hartree
kineticenergy: 551.80459088 hartree
exchangeener: -30.833107057142 hartree
correlationener: -2.542321626163 hartree
xcener: -33.375428683305 hartree
energy: -1816.8421 -528.1320 -398.3408 -398.2579 -284.9880 -283.7822 -150.6527 -104.2771 -104.1507 -104.0915 -27.3199 -26.5501 -25.9812 -22.4741 -18.9792 -16.3334 -15.6804 -15.1421 -13.8494 -13.3562 -12.3716 -11.6246 -10.8640 -10.2259 -10.1782 -8.5379 -8.4345 -8.1041 1.2545 2.0914 3.4937 3.8160 4.3191 4.8364 5.4503 5.5463 5.6814 6.0316 6.4516 6.6096 7.7136 7.9012 8.8828 11.8957 13.4125 13.8992 14.2467 14.7799 15.5214 15.8951 16.3464 17.2512 18.1723 18.8290 19.8922 21.6997 22.6534 23.0540 25.1348 25.9808 26.4138 26.9024 27.3364 27.7820 27.8753 28.3343 28.8130 29.1854 29.3588 30.3350 31.7599 32.0001 32.2438 34.5138 37.9872 38.9095 40.2826 40.8132 43.1317 46.5883 47.8465 49.9277 50.5076 51.2280 53.2243 53.8050 54.3107 55.1950 56.0786 57.1416 59.5643 59.9101 61.3321 61.6848 63.2591 63.5912 65.7842 66.4047 68.0881 68.7334 71.6511 73.1856 74.6628 78.6999 371.3208 379.6469 517.9618 521.3488 696.0068 electronvolt
chargesum: 0.0000000
charge: -0.943064 1.048359 -0.742135 -0.267826 -0.639020 -0.646512 0.355843 0.378627 0.341181 0.213036 0.250540 0.230920 0.218401 0.201649
charge: -0.547043 0.534653 -0.389127 -0.153687 -0.374547 -0.470270 0.249439 0.262035 0.247360 0.114027 0.142599 0.133634 0.130614 0.120312
qa: -0.9431 1.0484 -0.7421 -0.2678 -0.6390 -0.6465 0.3558 0.3786 0.3412 0.2130 0.2505 0.2309 0.2184 0.2016
va: 2.8230 4.2468 2.9290 3.7224 3.7216 2.0835 0.8482 0.8310 0.8502 0.9023 0.9029 0.9098 0.9129 0.9174
dispersion: -0.006193751 hartree
energy: -554.391332377511 hartree
dipole: -7.58784 7.45548 -0.13235 4.72212 -3.16865 1.55347 1.53042 -0.09394 1.43647
magnitude: 2.11996 au
magnitude: 5.38851 debye
temp: 298.15 k
press: 1.00 atm
zeropoint: 0.11714626 hartree
thermalvibcorrection: 0.00543960 hartree
thermalrotcorrection: 0.00141627 hartree
thermaltrasncorrection: 0.00141627 hartree
thermaltotal: -554.26591397 hartree
thermalcorr: 0.00827214 hartree
nonthermalcorr: 0.11714626 hartree
totalcorr: 0.12541840 hartree
thermalcorrenthalpy: 0.00094421 hartree
totalenthalpy: -554.26496977 hartree
vibrat: 0.00932554 hartree
rotat: 0.01313616 hartree
transl: 0.01892931 hartree
total: 0.04139100 hartree
totalentropycorr: -0.04139100 hartree
gibbsenthalpy: -554.30636077 hartree
gibbsminuselec: 0.08497161 hartree
