program: Orca
programVersion: 5.0.4
elementType: Si O H H
charge: 0
multiplicity: 1
keywords: SP DSD-BLYP D3BJ def2-QZVPP def2-QZVPP/C def2/J TightSCF
formula: H2OSi
InChI: InChI=1/H2OSi/c1-2/h2H2
4 atoms
Si -0.4248 0.245825 0.02433
O  0.89078 -0.515565 -0.050905
H  -0.540522 1.723937 0.029959
H  -1.762427 -0.389907 0.100143
totalener: -365.49638350 hartree
nucrepener: 52.33631026 hartree
electener: -417.83269377 hartree
oneelecener: -610.24308814 hartree
twoeener: 192.41039438 hartree
kineticenergy: 364.98417298 hartree
exchangeener: -9.101800212997 hartree
correlationener: -0.487297695035 hartree
xcener: -9.589097908032 hartree
energy: -1844.9986 -543.4019 -159.0318 -110.3287 -110.1014 -110.0399 -30.6004 -17.3915 -13.4747 -12.5767 -11.0339 -10.5668 -0.5171 1.3217 2.2563 2.8758 3.1513 4.2535 4.4573 5.1515 6.0482 7.8308 7.8948 8.2550 8.3776 9.8098 12.0587 12.1877 12.9433 13.1821 16.4254 16.9161 17.2897 17.6070 18.3194 19.4718 19.7569 19.9952 20.1849 20.6955 21.4835 22.1857 23.8130 23.8582 24.7041 25.9335 26.6875 27.7061 28.5322 32.2234 33.2147 35.6257 35.7296 36.2944 36.5733 38.7154 41.7434 42.1877 42.4198 43.4013 47.8940 48.8539 49.9515 51.3674 51.5619 52.8778 53.0288 53.2328 53.4864 54.1626 55.0742 57.8917 59.1643 59.5281 59.6144 60.9596 62.6024 62.7548 63.5875 64.4984 65.8344 66.0572 68.1067 70.6239 70.6660 71.4825 71.5742 72.9168 73.4245 75.0033 79.1660 79.9760 80.4072 83.8997 84.2611 89.2229 90.5753 90.7181 90.7646 91.0686 94.9370 98.2795 99.1033 100.1008 104.7483 107.5096 112.0239 116.1350 116.4082 116.9754 116.9772 122.9792 125.1123 129.2344 131.6467 135.2611 141.1811 148.2560 151.1763 153.2263 153.7726 159.7690 160.0622 160.8233 161.9250 163.5659 163.9756 164.6196 170.2436 170.9236 173.4275 173.6281 176.7399 178.3334 182.7509 185.9618 188.2851 189.0563 192.1579 193.8107 206.9213 217.4217 217.7633 221.0693 221.4400 222.3215 224.2223 227.3064 229.6276 237.0105 238.1991 239.6385 241.9189 245.3473 246.4695 250.5775 250.6791 251.0701 252.3142 253.9705 254.7074 256.6060 257.0771 258.7812 260.7199 262.0655 309.4268 309.8243 315.8552 316.5374 317.9478 326.8318 328.3188 332.8054 338.8882 339.8490 345.3306 347.2810 353.1216 355.3422 364.4778 384.8715 461.6244 1322.7807 1598.3001 6930.6589 8658.7111 electronvolt
chargesum: 0.0000000
charge: 0.699714 -0.592814 -0.053174 -0.053726
charge: 0.267249 -0.000602 -0.133346 -0.133301
qa: 0.6997 -0.5928 -0.0532 -0.0537
va: 4.0101 2.1250 0.9732 0.9731
total: -365.691441107 hartree
dispersion: -0.001515111 hartree
energy: -365.692956217892 hartree
dipole: -2.12318 0.68883 -1.43434 1.22991 -0.40029 0.82963 0.11992 -0.03746 0.08246
magnitude: 1.65904 au
magnitude: 4.21695 debye
