program: Orca
programVersion: 5.0.4
elementType: N C C Si F N C C H H H H H H H H H H H H
charge: 1
multiplicity: 1
keywords: Freq RIJCOSX PBEh-3c
frequency: 0.00 0.00 0.00 0.00 0.00 0.00 26.12 44.32 60.02 107.21 118.69 179.62 262.54 265.26 310.17 332.26 380.42 402.58 441.10 585.10 611.70 742.96 815.05 831.18 892.38 967.39 1050.14 1066.34 1127.00 1140.46 1164.24 1165.60 1180.88 1193.83 1331.27 1333.13 1420.15 1424.74 1473.18 1476.80 1481.64 1496.99 1538.20 1540.13 1544.03 1544.35 1559.49 1561.21 3128.07 3130.14 3136.36 3150.42 3185.83 3198.44 3218.49 3219.57 3227.32 3228.25 3627.08 3634.84
frequency: 26.12 44.32 60.02 107.21 118.69 179.62 262.54 265.26 310.17 332.26 380.42 402.58 441.10 585.10 611.70 742.96 815.05 831.18 892.38 967.39 1050.14 1066.34 1127.00 1140.46 1164.24 1165.60 1180.88 1193.83 1331.27 1333.13 1420.15 1424.74 1473.18 1476.80 1481.64 1496.99 1538.20 1540.13 1544.03 1544.35 1559.49 1561.21 3128.07 3130.14 3136.36 3150.42 3185.83 3198.44 3218.49 3219.57 3227.32 3228.25 3627.08 3634.84
formula: C4H12FN2Si
InChI: InChI=1/C4H12FN2Si/c1-3-6-8(5)7-4-2/h6-7H,3-4H2,1-2H3
20 atoms
N  -1.61098 0.484926 0.821605
C  -2.221383 -0.768549 0.339239
C  -3.428468 -0.501755 -0.535562
Si -0.081548 1.01743 0.559749
F  0.27984 2.431992 1.136945
N  1.098075 0.211609 -0.24468
C  2.498414 0.63815 -0.466908
C  3.480819 -0.367349 0.095886
H  -2.242094 1.072161 1.354331
H  -2.488102 -1.373416 1.206274
H  -1.469737 -1.334502 -0.213449
H  -3.164992 0.081408 -1.416901
H  -4.206517 0.032823 0.009646
H  -3.85747 -1.444749 -0.870765
H  0.892734 -0.702707 -0.628212
H  2.642158 1.614771 -0.006481
H  2.642458 0.769688 -1.539404
H  3.37553 -1.344569 -0.376645
H  3.362827 -0.489606 1.171747
H  4.498435 -0.027954 -0.092014
totalener: -657.23045354 hartree
nucrepener: 472.96203607 hartree
electener: -1130.19248961 hartree
oneelecener: -1828.76325299 hartree
twoeener: 698.57076337 hartree
kineticenergy: 653.78035206 hartree
exchangeener: -38.274189171658 hartree
correlationener: -3.238254370342 hartree
xcener: -41.512443542000 hartree
energy: -1824.3382 -688.6688 -404.0420 -404.0295 -289.7055 -289.4963 -287.6477 -287.5354 -158.0115 -111.6218 -111.5530 -111.4508 -41.5351 -32.5703 -32.0810 -27.0851 -26.8471 -23.5202 -23.3849 -22.5576 -20.8952 -20.7042 -19.6988 -19.4787 -19.0184 -18.7622 -18.0515 -17.9296 -16.7647 -16.6142 -15.6779 -15.5400 -15.2093 -15.0821 -14.3987 -13.4135 -4.7137 -4.2278 -2.6291 -1.3364 -0.1062 0.0203 0.7334 1.0577 1.3344 1.5613 1.6666 1.8262 2.1050 2.1821 2.3193 2.5231 2.6831 2.9905 3.3805 3.6641 4.2438 6.2068 8.1152 8.4039 8.6287 9.1837 10.2917 10.4619 10.6942 10.8143 11.3025 11.6600 11.7252 11.9384 12.6224 13.6830 13.9402 14.8750 16.2270 18.2949 18.4548 20.1636 21.1846 21.8785 21.9716 22.3121 22.8735 23.0725 23.6706 23.9203 24.1489 24.3494 24.5976 24.8249 25.2890 25.5437 25.7620 26.5565 26.8956 28.6217 28.7868 28.8705 29.4815 30.0584 31.4241 33.4888 34.4940 34.6480 35.2248 35.9533 36.7181 37.6519 38.3059 41.4547 42.6997 43.0549 44.0506 45.2636 46.0731 46.8439 47.9677 50.1629 50.3906 51.0145 51.2029 52.2052 52.4510 56.2605 56.5546 57.1999 58.2553 58.7402 59.4962 62.2208 62.3786 62.8818 63.4968 64.8958 66.5975 67.9140 68.3497 71.0677 71.2100 77.1503 367.0734 367.2247 375.3665 375.5987 515.2109 515.9139 887.8093 electronvolt
chargesum: 1.0000000
charge: -0.694690 -0.302424 -0.646444 1.351316 -0.410485 -0.704707 -0.307086 -0.650026 0.415220 0.282870 0.222863 0.240188 0.244327 0.268996 0.405269 0.259599 0.276689 0.235660 0.241232 0.271632
charge: -0.331877 -0.141588 -0.368052 0.816742 -0.165610 -0.332137 -0.142011 -0.368820 0.295129 0.148313 0.128383 0.141077 0.143586 0.158232 0.286732 0.146078 0.145869 0.139044 0.141267 0.159642
qa: -0.6947 -0.3024 -0.6464 1.3513 -0.4105 -0.7047 -0.3071 -0.6500 0.4152 0.2829 0.2229 0.2402 0.2443 0.2690 0.4053 0.2596 0.2767 0.2357 0.2412 0.2716
va: 3.0428 3.6576 3.6801 3.7993 1.0592 3.0427 3.6339 3.6835 0.8007 0.8753 0.9060 0.9058 0.9045 0.8952 0.8083 0.8936 0.8779 0.9070 0.9051 0.8944
dispersion: -0.009353571 hartree
energy: -657.208390714257 hartree
dipole: -0.25482 -0.10584 -0.36066 -10.53463 9.95240 -0.58223 -5.22465 5.06776 -0.15689
magnitude: 0.70263 au
magnitude: 1.78593 debye
temp: 298.15 k
press: 1.00 atm
zeropoint: 0.17604470 hartree
thermalvibcorrection: 0.00810634 hartree
thermalrotcorrection: 0.00141627 hartree
thermaltrasncorrection: 0.00141627 hartree
thermaltotal: -657.02140713 hartree
thermalcorr: 0.01093888 hartree
nonthermalcorr: 0.17604470 hartree
totalcorr: 0.18698358 hartree
thermalcorrenthalpy: 0.00094421 hartree
totalenthalpy: -657.02046292 hartree
vibrat: 0.01469950 hartree
rotat: 0.01413778 hartree
transl: 0.01929877 hartree
total: 0.04813605 hartree
totalentropycorr: -0.04813605 hartree
gibbsenthalpy: -657.06859897 hartree
gibbsminuselec: 0.13979174 hartree
