program: Gaussian 09
title: 000004517
version: EM64L-G09RevD.01
frameworkgroup: C1[X(C6H15N4O2)]
method: RPBEPBE
basis: SDD
operation: Freq
keyword: #p
keyword: freq=noraman
keyword: PBEPBE/SDD
title: #p freq=noraman PBEPBE/SDD
converged: YES YES NO NO
title: Mulliken charges:
elementType: O O N N N N C C C C C C H H H H H H H H H H H H H H H
charge: -0.440078 -0.422516 -0.051896 -0.294396 -0.027414 -0.055314 -0.349785 -0.397749 -0.306609 -0.309409 -0.708276 -0.700117 0.189388 0.189154 0.203895 0.247742 0.198966 0.169554 0.228985 0.180607 0.196853 0.217148 0.263226 0.163791 0.221325 0.199676 0.193248
chargesum: -1.00000
title: Mulliken charges with hydrogens summed into heavy atoms:
elementType: O O N N N N C C C C C C
charge: -0.440078 -0.422516 -0.051896 -0.065411 -0.027414 -0.055314 0.028757 0.053888 0.061911 0.068051 -0.064111 -0.085868
polarizability: 1.23690781e+02 -6.25549830e+00 1.12306078e+02 4.05714390e+00 -9.05050153e+00 9.93020439e+01
1716.lowfreq: -11.1919 -3.3564 0.0002 0.0004 0.0006 4.4752 28.7915 40.4411 53.7682
frequency: 28.3820 40.3931 53.6774 69.7766 88.5297 112.1166 129.8565 154.0489 186.6277 232.0444 247.2454 256.3515 266.7001 280.0322 312.9137 360.5853 413.1962 454.8573 478.5240 547.5354 584.0120 658.0460 719.2656 791.4261 803.7722 820.9319 859.1173 908.3102 928.3789 1010.6895 1022.9206 1037.3183 1069.6756 1090.1308 1106.5667 1120.6874 1132.4852 1141.4966 1161.2471 1174.9342 1210.7177 1218.2236 1255.7658 1267.2089 1278.9293 1296.9326 1334.2715 1361.0184 1371.9738 1378.0955 1396.3962 1438.4307 1441.9114 1454.8110 1457.6664 1467.8011 1478.6372 1481.7528 1487.8991 1496.8258 2844.8132 2857.4272 2902.7996 2950.3425 2967.4555 2971.8683 2986.0383 2988.5386 3001.0403 3037.3443 3058.5216 3067.3019 3077.7789 3095.7740 3388.5701
redmass: 4.5930 3.5761 2.5969 2.3792 2.4894 3.6627 1.8764 4.4326 2.1976 1.7074 3.5422 1.1348 6.5858 3.0061 3.7274 3.6875 5.0724 4.4723 3.5617 5.0165 5.5824 8.6817 1.3893 1.1515 1.1113 1.2263 2.4220 1.7396 5.8406 4.0483 3.1090 1.5890 2.5834 1.7880 1.9821 2.6157 2.5970 2.5289 5.8226 2.0615 8.0137 1.5168 1.1999 1.1682 1.1464 1.2279 1.3079 1.3216 1.2627 1.2587 1.4660 1.1553 1.1029 1.0426 1.0791 1.0540 1.0875 1.0578 1.0496 1.0861 1.0722 1.0679 1.0636 1.0661 1.0356 1.0402 1.0899 1.0863 1.0863 1.0984 1.0984 1.0970 1.0998 1.1004 1.0731
irintensity: 1.9148 3.0115 2.4155 4.4474 0.9837 4.3461 1.6237 2.1834 6.5747 3.8435 2.5798 0.9684 0.8220 5.0117 10.1867 2.8931 15.7657 13.2665 0.7267 17.9038 22.8257 3.8546 89.0123 3.7554 1.3813 2.1411 12.1651 4.8517 76.1022 14.7234 5.7538 30.7811 9.7757 4.0023 10.4507 69.0641 22.8842 19.7286 187.7836 31.2192 23.0748 11.2857 1.5180 4.8807 4.2137 13.3916 0.6429 4.0702 21.3354 32.5017 1.9147 21.0219 10.5427 8.3409 3.5278 14.9412 8.3134 0.3529 6.1844 4.3185 115.8345 87.0942 103.9111 17.1001 52.3330 64.7170 29.1190 36.3851 53.0314 57.8482 77.5367 52.1519 51.1619 26.0413 6.8224
temp: 298.150 k
press: 1.00000 atm
elementType: 8 8 7 7 7 7 6 6 6 6 6 6 1 1 1 1 1 1 1 1 1 1 1 1 1 1 1
symmnumber: 1
zpe: 577950.0 jmol-1
zpe.correction: 0.220130 hartree
zpe.thermalcorrener: 0.235074 hartree
zpe.thermalcorrenthalpy: 0.236019 hartree
zpe.thermalcorrgfe: 0.176670 hartree
zpe.sumelectzpe: -605.986821 hartree
zpe.sumelectthermal: -605.971876 hartree
zpe.sumelectthermalent: -605.970931 hartree
zpe.sumelectthermalfe: -606.030281 hartree
dipole: -6.0703 -5.4769 -1.1138
dipole: 8.2514
quadrupole: -93.3123 -93.4651 -87.9236
quadrupole: -11.7517 -6.7778 2.0616
quadrupole: -1.7453 -1.8981 3.6434 -11.7517 -6.7778 2.0616
hfenergy: -606.2069501 hartree
pointgroup: C01 [X(C6H15N4O2)]
dipole: -2.4769456 1.9319293 0.8192109 debye
polarizability: 122.7359048|7.0398644|115.424177|-3.4524005|-7.148981|97.1388215 unknown
InChI: InChI=1S/C6H15N4O2/c1-3-7-5-6-9(4-2)10(12)8-11/h7H,3-6H2,1-2H3
charge -1 multiplicity 1
27 atoms
O  1.759975 0.239972 -2.04437
O  1.136199 -2.185178 0.502082
N  1.164653 0.577455 0.318461
N  -2.615002 0.538335 0.022236
N  1.480618 -0.354843 -0.863937
N  1.486855 -1.72275 -0.698035
C  -0.205051 1.117033 0.097259
C  -1.266284 0.060236 0.445357
C  2.193285 1.656841 0.318079
C  -3.695428 -0.43781 0.276269
C  3.59854 1.076046 0.538927
C  -5.054137 0.09911 -0.211231
H  -0.32407 1.449302 -0.965737
H  -0.343155 2.005606 0.744463
H  -1.277592 -0.103626 1.539052
H  -0.978773 -0.910552 -0.014867
H  2.176036 2.231759 -0.637707
H  1.924379 2.34035 1.149918
H  -2.591429 0.791787 -0.979011
H  -3.497666 -1.435545 -0.194775
H  -3.738733 -0.617209 1.369578
H  3.623498 0.467361 1.460585
H  3.864663 0.429215 -0.314557
H  4.349297 1.887261 0.616733
H  -5.27881 1.064008 0.278356
H  -5.042424 0.267265 -1.306175
H  -5.868944 -0.61543 0.012448
