program: Orca
programVersion: 5.0.4
elementType: N C C Si F F N C C C C H H H H H H H H H H H H H H H H
charge: 0
multiplicity: 1
keywords: SP DSD-BLYP D3BJ def2-QZVPP def2-QZVPP/C def2/J TightSCF
formula: C6H16F2N2Si
InChI: InChI=1/C6H16F2N2Si/c1-4-9-11(7,8)10(5-2)6-3/h9H,4-6H2,1-3H3
27 atoms
N  1.605776 0.832194 -0.088835
C  2.014367 0.527464 -1.446899
C  3.196774 -0.425964 -1.53291
Si 0.377334 0.006214 0.744059
F  0.682919 -1.548304 1.055017
F  0.318606 0.683456 2.20686
N  -1.075431 0.015885 -0.1357
C  -2.030339 -1.080427 -0.075392
C  -1.905424 -2.03602 -1.252399
C  -1.500472 1.168279 -0.911926
C  -2.43929 2.101909 -0.160668
H  2.295944 1.34126 0.440891
H  2.249224 1.455729 -1.976798
H  1.160067 0.093865 -1.972106
H  3.468492 -0.620961 -2.571334
H  2.963258 -1.379013 -1.058166
H  4.075732 -0.012636 -1.035609
H  -3.045272 -0.672577 -0.034269
H  -1.908866 -1.638418 0.854278
H  -2.669321 -2.813485 -1.205732
H  -0.930324 -2.522424 -1.250654
H  -2.021068 -1.51762 -2.20526
H  -1.984759 0.821124 -1.831169
H  -0.621222 1.729188 -1.233425
H  -3.332394 1.583124 0.18941
H  -1.944628 2.533908 0.709351
H  -2.767325 2.920407 -0.803257
totalener: -835.56528324 hartree
nucrepener: 832.46476293 hartree
electener: -1668.03004618 hartree
oneelecener: -2805.29997878 hartree
twoeener: 1137.26993260 hartree
kineticenergy: 833.85894494 hartree
exchangeener: -28.206826459134 hartree
correlationener: -1.848130020907 hartree
xcener: -30.054956480041 hartree
chargesum: -0.0000000
charge: -0.539107 0.108383 -0.167825 1.145963 -0.449928 -0.447504 -0.376679 0.069098 -0.177840 0.075921 -0.174845 0.164513 0.055319 0.041017 0.047050 0.071921 0.037455 0.047677 0.051413 0.046094 0.068909 0.043997 0.046843 0.052223 0.044669 0.069169 0.046095
charge: 0.489519 -0.034351 0.229372 -0.855781 0.246823 0.241138 0.344501 -0.021806 0.229984 -0.028948 0.232699 -0.192932 -0.059545 -0.047630 -0.064599 -0.061297 -0.066198 -0.051638 -0.045557 -0.064569 -0.062164 -0.067203 -0.051643 -0.045539 -0.066379 -0.061259 -0.064998
qa: -0.5391 0.1084 -0.1678 1.1460 -0.4499 -0.4475 -0.3767 0.0691 -0.1778 0.0759 -0.1748 0.1645 0.0553 0.0410 0.0471 0.0719 0.0375 0.0477 0.0514 0.0461 0.0689 0.0440 0.0468 0.0522 0.0447 0.0692 0.0461
va: 2.9732 3.8288 3.8631 4.3801 0.9222 0.9119 2.8302 3.8608 3.8806 3.8534 3.8802 1.0400 0.9799 0.9904 1.0080 1.0010 1.0040 0.9874 0.9941 1.0089 0.9987 0.9999 0.9829 0.9898 1.0050 0.9990 1.0046
total: -836.664137883 hartree
dispersion: -0.016991978 hartree
energy: -836.681129860965 hartree
dipole: -5.64901 5.58878 -0.06022 2.02658 -1.63841 0.38817 -17.12310 16.10072 -1.02238
magnitude: 1.09525 au
magnitude: 2.78389 debye
