program: Orca
programVersion: 5.0.4
elementType: C C N C C Si F F N C C C C H H H H H H H H H H H H H H H H H H H H
charge: 0
multiplicity: 1
keywords: Freq RIJCOSX PBEh-3c
frequency: 0.00 0.00 0.00 0.00 0.00 0.00 20.00 44.85 56.35 66.20 74.99 76.07 92.96 141.77 176.95 196.85 211.24 228.71 231.77 257.33 279.41 289.34 300.29 321.14 343.11 352.56 362.34 435.63 471.75 531.03 540.43 638.13 742.85 810.81 811.09 812.71 815.43 890.09 944.42 958.40 961.26 987.15 991.44 1095.04 1103.25 1129.01 1129.37 1137.31 1140.31 1158.58 1159.05 1253.46 1256.70 1284.11 1285.39 1363.21 1367.83 1421.47 1423.68 1430.23 1433.40 1448.74 1452.12 1467.70 1469.30 1470.26 1472.59 1533.80 1539.39 1544.45 1545.69 1545.76 1546.55 1547.79 1548.47 1556.46 1558.85 1566.03 1567.80 3091.62 3094.61 3103.28 3103.58 3113.90 3115.48 3115.77 3117.95 3143.65 3152.80 3163.47 3172.67 3196.67 3198.04 3198.11 3198.36 3202.06 3203.15 3208.78 3208.85
frequency: 20.00 44.85 56.35 66.20 74.99 76.07 92.96 141.77 176.95 196.85 211.24 228.71 231.77 257.33 279.41 289.34 300.29 321.14 343.11 352.56 362.34 435.63 471.75 531.03 540.43 638.13 742.85 810.81 811.09 812.71 815.43 890.09 944.42 958.40 961.26 987.15 991.44 1095.04 1103.25 1129.01 1129.37 1137.31 1140.31 1158.58 1159.05 1253.46 1256.70 1284.11 1285.39 1363.21 1367.83 1421.47 1423.68 1430.23 1433.40 1448.74 1452.12 1467.70 1469.30 1470.26 1472.59 1533.80 1539.39 1544.45 1545.69 1545.76 1546.55 1547.79 1548.47 1556.46 1558.85 1566.03 1567.80 3091.62 3094.61 3103.28 3103.58 3113.90 3115.48 3115.77 3117.95 3143.65 3152.80 3163.47 3172.67 3196.67 3198.04 3198.11 3198.36 3202.06 3203.15 3208.78 3208.85
formula: C8H20F2N2Si
InChI: InChI=1/C8H20F2N2Si/c1-5-11(6-2)13(9,10)12(7-3)8-4/h5-8H2,1-4H3
33 atoms
C  2.123628 1.844421 -1.627304
C  1.482189 0.533537 -1.19346
N  1.393656 0.376675 0.249498
C  2.599277 -0.103152 0.905508
C  2.72344 -1.620428 0.871811
Si -0.041407 0.797507 1.057124
F  -0.353762 2.381934 1.082289
F  0.182906 0.419648 2.610118
N  -1.402854 0.079469 0.334126
C  -2.704272 0.730596 0.278941
C  -2.97318 1.394166 -1.063955
C  -1.373805 -1.290377 -0.149405
C  -1.822303 -2.316187 0.883286
H  1.536295 2.695834 -1.283711
H  3.13206 1.953557 -1.226467
H  2.195207 1.898955 -2.71457
H  2.038985 -0.309185 -1.616928
H  0.479381 0.467255 -1.623049
H  3.473918 0.348568 0.426648
H  2.624202 0.239279 1.939964
H  2.697782 -2.001437 -0.150263
H  1.906296 -2.086861 1.423258
H  3.662075 -1.947743 1.321067
H  -3.484151 -0.008012 0.489845
H  -2.790938 1.474012 1.07248
H  -2.898314 0.678944 -1.884652
H  -2.254302 2.192495 -1.246738
H  -3.973965 1.827424 -1.09373
H  -2.005025 -1.36508 -1.040981
H  -0.36255 -1.537172 -0.480198
H  -2.824618 -2.101969 1.255965
H  -1.147764 -2.327742 1.74012
H  -1.837987 -3.318831 0.453262
totalener: -914.15572127 hartree
nucrepener: 1082.75133152 hartree
electener: -1996.90705279 hartree
oneelecener: -3408.99738216 hartree
twoeener: 1412.09032936 hartree
kineticenergy: 908.63705670 hartree
exchangeener: -57.230352246533 hartree
correlationener: -5.081732076187 hartree
xcener: -62.312084322720 hartree
energy: -1818.4391 -682.2498 -682.2204 -398.0073 -397.9868 -284.8974 -284.8740 -284.8348 -284.8161 -283.6854 -283.6697 -283.6495 -283.6214 -151.8454 -105.4489 -105.4018 -105.3504 -35.3250 -34.7866 -27.5769 -27.1952 -23.2339 -23.2042 -21.9656 -21.7184 -19.4849 -19.3098 -18.5507 -17.7795 -16.4275 -15.3998 -15.3206 -15.1080 -14.6774 -14.2988 -13.6574 -13.6270 -13.4362 -13.1415 -13.0844 -12.8895 -12.7058 -12.6850 -12.6087 -12.5220 -11.9118 -11.6851 -11.5972 -11.5064 -11.4149 -11.3787 -10.7418 -10.6793 -10.5006 -10.2088 -7.6194 -7.5489 2.6492 3.1593 3.6994 3.8860 4.1164 4.2184 4.4928 4.6344 4.9387 4.9851 5.2082 5.5951 5.6569 5.6817 5.8050 5.9270 6.0933 6.2693 6.4108 6.4205 6.7509 6.8092 6.9238 7.0321 7.1491 7.6561 7.7416 8.0288 8.2109 8.2713 8.6137 8.6793 10.1642 12.0734 12.3536 13.4889 13.7768 13.8803 14.0686 14.2058 14.4223 14.5641 14.9663 15.1591 15.4655 15.7471 16.1055 16.5076 16.9519 17.0756 17.3027 17.3851 18.0136 18.2326 18.5997 18.8780 19.7944 20.6276 20.8071 21.3011 22.4403 22.6302 23.7683 24.1568 24.8368 26.1381 26.5583 26.6930 26.9006 27.0918 27.1625 27.5094 27.8358 28.1701 28.2780 28.4885 28.6872 28.8430 29.0246 29.0347 29.5038 29.7160 29.9635 30.1765 30.2346 30.5085 30.7266 30.7815 31.4009 31.5677 32.1808 32.4669 33.1552 33.2394 33.9035 34.7085 35.2248 35.4047 35.5719 36.4542 36.7357 36.9519 37.3591 37.8393 38.2635 38.7947 39.0581 40.2772 40.3754 41.1366 41.5350 42.8765 43.3011 44.3680 44.5878 45.3766 46.0753 48.0107 48.4427 49.0227 49.3420 49.7813 49.9630 50.2219 50.9806 51.8020 52.5383 52.7520 53.2716 54.3696 54.5186 54.9149 55.2707 55.6059 56.1408 57.2142 57.5904 58.0398 58.8901 59.1014 59.3832 60.8690 61.0119 61.4081 61.5729 64.0637 64.3880 65.4267 65.4612 65.7220 65.7941 65.8566 65.9743 66.0500 66.4459 68.0066 68.3462 71.7014 72.1849 72.8241 73.2264 74.2403 74.7240 74.9577 75.3946 76.4504 78.3749 82.1059 82.4746 370.9054 371.3075 372.4010 373.0606 379.4087 379.5753 382.3648 382.5009 523.9760 525.4898 892.8246 894.6307 electronvolt
chargesum: -0.0000000
charge: -0.630555 -0.309675 -0.557673 -0.290379 -0.637078 1.378357 -0.458422 -0.458093 -0.555139 -0.291716 -0.634272 -0.309752 -0.631525 0.231557 0.213706 0.211272 0.212516 0.230259 0.210439 0.238611 0.208862 0.221159 0.215490 0.211163 0.234425 0.208129 0.227124 0.212742 0.212422 0.233485 0.215537 0.225479 0.211547
charge: -0.371813 -0.152458 -0.265781 -0.146746 -0.373305 0.609311 -0.246398 -0.245184 -0.265080 -0.146473 -0.372623 -0.152146 -0.372408 0.133717 0.124769 0.126485 0.114328 0.127479 0.114549 0.131999 0.122177 0.128406 0.127830 0.114892 0.129863 0.122216 0.131460 0.126822 0.114928 0.126787 0.125436 0.130551 0.126409
qa: -0.6306 -0.3097 -0.5577 -0.2904 -0.6371 1.3784 -0.4584 -0.4581 -0.5551 -0.2917 -0.6343 -0.3098 -0.6315 0.2316 0.2137 0.2113 0.2125 0.2303 0.2104 0.2386 0.2089 0.2212 0.2155 0.2112 0.2344 0.2081 0.2271 0.2127 0.2124 0.2335 0.2155 0.2255 0.2115
va: 3.7143 3.7484 2.9921 3.7484 3.7210 4.0123 0.9650 0.9681 2.9912 3.7518 3.7196 3.7550 3.7155 0.9113 0.9162 0.9137 0.9077 0.9086 0.9073 0.9055 0.9170 0.9141 0.9134 0.9075 0.9049 0.9172 0.9128 0.9142 0.9076 0.9047 0.9156 0.9129 0.9136
dispersion: -0.020029360 hartree
energy: -914.116788075907 hartree
dipole: 0.61431 -0.56875 0.04556 -11.18460 10.54973 -0.63487 -14.71822 13.91375 -0.80447
magnitude: 1.02582 au
magnitude: 2.60742 debye
temp: 298.15 k
press: 1.00 atm
zeropoint: 0.29507463 hartree
thermalvibcorrection: 0.01439642 hartree
thermalrotcorrection: 0.00141627 hartree
thermaltrasncorrection: 0.00141627 hartree
thermaltotal: -913.80448448 hartree
thermalcorr: 0.01722896 hartree
nonthermalcorr: 0.29507463 hartree
totalcorr: 0.31230360 hartree
thermalcorrenthalpy: 0.00094421 hartree
totalenthalpy: -913.80354027 hartree
vibrat: 0.02598706 hartree
rotat: 0.01509407 hartree
transl: 0.01992434 hartree
total: 0.06100547 hartree
totalentropycorr: -0.06100547 hartree
gibbsenthalpy: -913.86454574 hartree
gibbsminuselec: 0.25224233 hartree
