program: Orca
programVersion: 5.0.4
elementType: N Si F N C C C C C C H H H H H H H H
charge: 1
multiplicity: 1
keywords: Freq RIJCOSX PBEh-3c
frequency: 0.00 0.00 0.00 0.00 0.00 0.00 22.58 74.76 78.75 205.69 256.76 304.60 318.49 381.52 430.60 449.11 499.11 551.25 569.12 592.68 643.13 730.39 782.85 822.05 855.75 892.73 898.48 988.80 1041.41 1046.11 1072.01 1083.23 1114.53 1141.40 1152.28 1224.76 1236.15 1272.91 1371.90 1395.98 1401.60 1538.42 1581.27 1634.10 1708.25 1713.37 3269.82 3275.09 3287.93 3296.79 3304.72 3622.34 3633.00 3729.62
frequency: 22.58 74.76 78.75 205.69 256.76 304.60 318.49 381.52 430.60 449.11 499.11 551.25 569.12 592.68 643.13 730.39 782.85 822.05 855.75 892.73 898.48 988.80 1041.41 1046.11 1072.01 1083.23 1114.53 1141.40 1152.28 1224.76 1236.15 1272.91 1371.90 1395.98 1401.60 1538.42 1581.27 1634.10 1708.25 1713.37 3269.82 3275.09 3287.93 3296.79 3304.72 3622.34 3633.00 3729.62
formula: C6H8FN2Si
InChI: InChI=1/C6H8FN2Si/c7-10(8)9-6-4-2-1-3-5-6/h1-5,9H,8H2
18 atoms
N  2.690663 0.105125 0.947596
Si 2.510238 -0.377496 -0.610953
F  3.806532 -0.754713 -1.407405
N  1.055245 -0.485096 -1.35971
C  -0.154833 -0.178264 -0.632834
C  -0.896539 -1.211679 -0.076729
C  -2.062774 -0.91372 0.610728
C  -2.47269 0.405209 0.74878
C  -1.721434 1.431602 0.195222
C  -0.557427 1.143695 -0.50245
H  1.906655 0.372061 1.527985
H  3.582491 0.164275 1.418902
H  0.954237 -0.778495 -2.324596
H  -0.575758 -2.239363 -0.191101
H  -2.651617 -1.713771 1.037473
H  -3.383887 0.632804 1.284675
H  -2.045357 2.458251 0.295599
H  0.016354 1.939675 -0.960983
totalener: -730.85399373 hartree
nucrepener: 584.49286091 hartree
electener: -1315.34685464 hartree
oneelecener: -2149.48987317 hartree
twoeener: 834.14301853 hartree
kineticenergy: 726.91094795 hartree
exchangeener: -43.291556272619 hartree
correlationener: -3.624343500182 hartree
xcener: -46.915899772801 hartree
energy: -1824.6810 -688.9013 -404.2610 -404.1001 -289.7673 -288.4001 -288.3570 -288.0970 -288.0828 -288.0169 -158.3486 -111.9635 -111.8851 -111.7872 -41.7678 -32.8778 -31.8337 -29.7649 -26.8277 -26.5331 -23.0390 -22.7165 -22.5398 -21.5652 -20.8446 -20.2892 -20.2322 -19.8830 -19.2606 -18.6730 -18.3912 -17.3821 -17.0815 -15.7280 -15.4966 -15.0978 -15.0207 -14.1308 -12.0101 -11.9440 -4.9539 -4.4982 -3.6422 -3.3558 -2.1823 -1.1528 -0.1869 0.2935 0.7882 1.0628 1.8104 1.9583 2.0879 2.4074 2.9039 3.3047 3.9618 5.0301 5.2813 5.7992 6.1447 6.2565 8.1123 8.2344 8.6732 8.9658 10.1270 10.4925 11.4517 12.0402 12.2173 12.3048 12.6860 13.1393 13.2128 13.6183 13.7787 14.2101 14.4965 14.5586 15.3211 16.5164 16.7719 17.5175 17.8097 18.2863 19.7526 20.4582 20.7513 21.4737 21.9217 22.1161 22.6050 22.7984 23.1843 23.5681 23.8821 24.7569 24.9483 25.3332 26.0803 26.5018 27.0679 27.9184 28.1356 28.6436 28.9674 29.3446 29.6445 30.2542 30.8251 31.3753 31.8369 32.6617 33.9378 36.5374 36.5881 37.4911 37.7720 38.2816 38.6909 40.7974 41.3504 41.9480 43.3957 44.5016 45.4281 46.3625 46.7229 46.9697 47.4919 49.4311 50.9260 52.1933 54.4673 54.5741 54.7476 55.5324 56.0247 56.2309 58.0792 59.3162 60.1152 60.5485 60.8788 61.8622 63.8993 64.1567 67.0964 67.5420 68.7049 70.6680 71.2729 71.6829 72.9136 74.1474 76.0727 77.5834 81.2316 90.8385 356.2285 367.9603 368.0463 380.8325 381.2922 392.7444 512.3946 520.3439 887.7945 electronvolt
chargesum: 1.0000000
charge: -0.884463 1.367722 -0.400538 -0.813297 0.247866 -0.234994 -0.221374 -0.204940 -0.223002 -0.248600 0.437528 0.435016 0.422251 0.257752 0.268357 0.269999 0.267341 0.257376
charge: -0.464361 0.848804 -0.158305 -0.301280 -0.033095 -0.130574 -0.106874 -0.100124 -0.109762 -0.137787 0.303108 0.301650 0.303723 0.154172 0.159309 0.159701 0.158834 0.152858
qa: -0.8845 1.3677 -0.4005 -0.8133 0.2479 -0.2350 -0.2214 -0.2049 -0.2230 -0.2486 0.4375 0.4350 0.4223 0.2578 0.2684 0.2700 0.2673 0.2574
va: 2.9582 3.8053 1.0762 2.9726 3.4986 3.7920 3.8041 3.7770 3.8063 3.8023 0.7927 0.7930 0.7988 0.8978 0.8938 0.8926 0.8943 0.8972
dispersion: -0.010888325 hartree
energy: -730.840487603432 hartree
dipole: -9.85991 11.21901 1.35910 2.39852 -2.36360 0.03491 5.12398 -4.64349 0.48049
magnitude: 1.44195 au
magnitude: 3.66516 debye
temp: 298.15 k
press: 1.00 atm
zeropoint: 0.14238136 hartree
thermalvibcorrection: 0.00679188 hartree
thermalrotcorrection: 0.00141627 hartree
thermaltrasncorrection: 0.00141627 hartree
thermaltotal: -730.68848182 hartree
thermalcorr: 0.00962442 hartree
nonthermalcorr: 0.14238136 hartree
totalcorr: 0.15200578 hartree
thermalcorrenthalpy: 0.00094421 hartree
totalenthalpy: -730.68753761 hartree
vibrat: 0.01170629 hartree
rotat: 0.01430209 hartree
transl: 0.01949401 hartree
total: 0.04550239 hartree
totalentropycorr: -0.04550239 hartree
gibbsenthalpy: -730.73304000 hartree
gibbsminuselec: 0.10744761 hartree
