program: Orca
programVersion: 5.0.4
elementType: N Si N C C C C C C O H H H H H H H H
charge: 0
multiplicity: 1
keywords: SP DSD-BLYP D3BJ def2-QZVPP def2-QZVPP/C def2/J TightSCF
formula: C6H8N2OSi
InChI: InChI=1/C6H8N2OSi/c7-10(9)8-6-4-2-1-3-5-6/h1-5,8H,7H2
18 atoms
N  1.96925 1.463972 -0.026503
Si 2.134185 -0.210455 -0.063677
N  0.596548 -0.945817 0.013891
C  -0.689365 -0.390046 0.030543
C  -1.661614 -0.902931 0.888794
C  -2.93904 -0.36921 0.906281
C  -3.269066 0.697746 0.083119
C  -2.308348 1.208002 -0.775752
C  -1.034064 0.662654 -0.816256
O  3.42801 -1.000834 -0.149942
H  2.774446 2.064585 -0.06425
H  1.109374 1.950112 0.162797
H  0.621147 -1.939348 0.192891
H  -1.410793 -1.720342 1.554108
H  -3.678401 -0.785442 1.577977
H  -4.264611 1.119363 0.104545
H  -2.555403 2.025461 -1.440462
H  -0.313303 1.037384 -1.532128
totalener: -706.40666126 hartree
nucrepener: 568.75463380 hartree
electener: -1275.16129506 hartree
oneelecener: -2097.20918888 hartree
twoeener: 822.04789382 hartree
kineticenergy: 704.96445254 hartree
exchangeener: -23.601697539047 hartree
correlationener: -1.526086947681 hartree
xcener: -25.127784486728 hartree
chargesum: 0.0000000
charge: -0.563110 0.906934 -0.499644 0.258146 -0.109407 -0.099521 -0.113857 -0.106276 -0.101854 -0.662116 0.207196 0.210015 0.203405 0.086616 0.095324 0.093600 0.100003 0.094546
charge: 0.602095 -0.385325 0.508095 -0.237612 0.073543 0.067850 0.057957 0.063846 0.063785 0.010343 -0.183472 -0.188221 -0.163491 -0.057617 -0.056123 -0.061887 -0.056763 -0.057004
qa: -0.5631 0.9069 -0.4996 0.2581 -0.1094 -0.0995 -0.1139 -0.1063 -0.1019 -0.6621 0.2072 0.2100 0.2034 0.0866 0.0953 0.0936 0.1000 0.0945
va: 3.0738 4.5126 2.9382 3.5424 3.7616 3.8426 3.8259 3.8292 3.7315 2.0575 1.0114 1.0091 1.0127 0.9911 0.9857 0.9897 0.9847 0.9935
total: -707.305960516 hartree
dispersion: -0.014859799 hartree
energy: -707.320820315396 hartree
dipole: -7.29697 5.49734 -1.79963 3.51982 -2.40715 1.11267 0.52247 -0.26225 0.26022
magnitude: 2.13176 au
magnitude: 5.41851 debye
