program: Orca
programVersion: 5.0.4
elementType: N Si N C C C C C C H H H H H H H H
charge: 2
multiplicity: 1
keywords: Freq RIJCOSX PBEh-3c
frequency: 0.00 0.00 0.00 0.00 0.00 0.00 27.49 69.34 127.29 167.32 238.51 290.11 341.74 401.95 477.56 552.42 567.45 607.39 627.56 734.72 781.26 816.99 834.40 852.61 959.03 996.17 1011.54 1022.33 1032.76 1053.97 1063.77 1159.63 1216.34 1258.05 1301.81 1434.50 1474.34 1520.10 1549.29 1620.09 1626.49 1659.68 1727.04 3267.96 3272.25 3276.47 3301.69 3303.78 3472.84 3579.43 3677.42
frequency: 27.49 69.34 127.29 167.32 238.51 290.11 341.74 401.95 477.56 552.42 567.45 607.39 627.56 734.72 781.26 816.99 834.40 852.61 959.03 996.17 1011.54 1022.33 1032.76 1053.97 1063.77 1159.63 1216.34 1258.05 1301.81 1434.50 1474.34 1520.10 1549.29 1620.09 1626.49 1659.68 1727.04 3267.96 3272.25 3276.47 3301.69 3303.78 3472.84 3579.43 3677.42
formula: C6H8N2Si
InChI: InChI=1/C6H8N2Si/c7-9-8-6-4-2-1-3-5-6/h1-5,8H,7H2
17 atoms
N  3.669023 -0.076848 0.144921
Si 2.744142 -0.422667 1.488907
N  1.097672 -0.962378 0.58803
C  -0.068935 -0.400854 0.463217
C  -0.188388 1.050239 0.489448
C  -1.385334 1.624381 0.224457
C  -2.512651 0.800289 -0.040475
C  -2.440702 -0.61302 -0.047975
C  -1.256136 -1.215852 0.221903
H  3.433378 -0.139314 -0.838836
H  4.640411 0.199436 0.264592
H  1.060624 -1.986772 0.528155
H  0.679493 1.6616 0.708996
H  -1.499887 2.700163 0.225887
H  -3.469807 1.275106 -0.230709
H  -3.329224 -1.196058 -0.251085
H  -1.173677 -2.297551 0.239967
totalener: -630.62483562 hartree
nucrepener: 459.05354505 hartree
electener: -1089.67838067 hartree
oneelecener: -1748.01663261 hartree
twoeener: 658.33825194 hartree
kineticenergy: 627.54381094 hartree
exchangeener: -37.383451666218 hartree
correlationener: -3.129843978058 hartree
xcener: -40.513295644276 hartree
energy: -1826.6127 -410.4119 -407.2528 -296.5853 -295.4021 -294.9070 -294.8414 -294.1044 -294.0399 -160.4238 -113.9234 -113.9131 -113.7876 -39.1188 -35.7174 -34.8225 -33.1115 -32.0288 -28.9888 -28.5923 -26.4741 -25.8150 -25.1574 -24.2889 -23.8170 -23.1756 -23.0935 -22.8532 -22.0274 -21.2519 -20.5044 -19.9357 -18.2956 -18.0562 -17.0460 -13.7408 -9.7283 -9.0508 -8.8647 -7.3034 -5.8974 -5.1595 -4.7664 -4.2864 -3.3435 -3.1972 -2.9062 -2.6021 -2.2524 -2.0747 -1.0754 -0.9466 -0.4909 0.0082 0.6799 1.3742 2.9390 3.4510 4.0112 4.1158 4.5960 4.8403 5.3266 5.6670 5.9753 6.2604 6.6018 6.8037 7.1020 7.3037 7.4145 8.0308 8.5261 8.8576 9.0944 9.6811 10.4943 11.1120 11.6602 11.8469 14.5246 14.9292 15.4958 16.5656 16.8088 17.3797 17.5762 17.9390 18.2526 18.3824 19.0594 19.3907 19.6076 20.1364 20.3674 20.9291 21.2269 22.0094 22.6236 23.5428 24.9263 25.4895 26.3383 28.3566 29.8419 30.3449 30.8677 31.6890 32.0333 32.2303 32.5375 37.0298 37.7911 38.2069 39.4976 40.2136 42.2367 43.1603 43.6177 44.2462 45.7876 46.3856 47.3443 48.2854 49.4372 50.5559 51.0289 51.7222 52.0285 53.1325 54.3833 55.3582 56.1174 58.9428 59.3322 59.8193 61.7521 62.6550 63.3677 65.1197 65.7645 65.8980 67.8097 69.5709 75.6077 83.1575 349.6277 360.6791 362.5269 372.7229 375.2505 384.2806 508.7147 515.9875 electronvolt
chargesum: 2.0000000
charge: -0.853121 0.849177 -0.693799 0.460623 -0.202931 -0.176113 -0.110185 -0.176678 -0.210376 0.432107 0.451158 0.449332 0.334973 0.358401 0.378591 0.360667 0.348173
charge: -0.434919 0.593902 -0.115430 0.088996 -0.022550 -0.074428 0.131019 -0.080265 -0.011667 0.293366 0.307996 0.311598 0.191546 0.204929 0.211773 0.206426 0.197707
qa: -0.8531 0.8492 -0.6938 0.4606 -0.2029 -0.1761 -0.1102 -0.1767 -0.2104 0.4321 0.4512 0.4493 0.3350 0.3584 0.3786 0.3607 0.3482
va: 3.0277 2.3553 3.0413 3.4983 3.6922 3.7030 3.5286 3.6893 3.6831 0.7955 0.7768 0.7763 0.8638 0.8479 0.8326 0.8466 0.8526
dispersion: -0.009987734 hartree
energy: -630.612919340882 hartree
dipole: -2.54059 2.52551 -0.01508 0.83776 -1.02072 -0.18297 -3.22337 2.73948 -0.48389
magnitude: 0.51754 au
magnitude: 1.31549 debye
temp: 298.15 k
press: 1.00 atm
zeropoint: 0.13749855 hartree
thermalvibcorrection: 0.00622041 hartree
thermalrotcorrection: 0.00141627 hartree
thermaltrasncorrection: 0.00141627 hartree
thermaltotal: -630.46636784 hartree
thermalcorr: 0.00905295 hartree
nonthermalcorr: 0.13749855 hartree
totalcorr: 0.14655150 hartree
thermalcorrenthalpy: 0.00094421 hartree
totalenthalpy: -630.46542363 hartree
vibrat: 0.01084245 hartree
rotat: 0.01405964 hartree
transl: 0.01930912 hartree
total: 0.04421121 hartree
totalentropycorr: -0.04421121 hartree
gibbsenthalpy: -630.50963484 hartree
gibbsminuselec: 0.10328450 hartree
