program: Orca
programVersion: 5.0.4
elementType: N C C C C C C Si F F N C C C C C C H H H H H H H H H H H H
charge: 0
multiplicity: 1
keywords: Freq RIJCOSX PBEh-3c
frequency: 0.00 0.00 0.00 0.00 0.00 0.00 9.80 26.58 34.92 61.62 107.40 115.51 178.92 222.02 236.18 267.01 270.78 294.51 308.95 409.97 424.66 427.80 450.81 496.27 511.77 551.91 554.35 595.88 611.45 643.45 646.57 726.45 728.52 759.80 799.63 802.02 828.68 866.16 868.68 889.45 938.32 944.54 959.04 978.50 1010.56 1011.63 1027.38 1036.06 1036.58 1040.97 1041.17 1094.21 1095.41 1148.94 1149.40 1215.02 1215.30 1249.52 1250.23 1303.22 1312.04 1378.92 1379.91 1410.09 1410.26 1473.01 1476.87 1569.58 1571.63 1593.90 1600.33 1710.97 1711.05 1731.68 1736.80 3244.36 3244.67 3267.08 3268.00 3274.21 3275.67 3282.54 3285.98 3294.02 3294.71 3659.04 3661.11
frequency: 9.80 26.58 34.92 61.62 107.40 115.51 178.92 222.02 236.18 267.01 270.78 294.51 308.95 409.97 424.66 427.80 450.81 496.27 511.77 551.91 554.35 595.88 611.45 643.45 646.57 726.45 728.52 759.80 799.63 802.02 828.68 866.16 868.68 889.45 938.32 944.54 959.04 978.50 1010.56 1011.63 1027.38 1036.06 1036.58 1040.97 1041.17 1094.21 1095.41 1148.94 1149.40 1215.02 1215.30 1249.52 1250.23 1303.22 1312.04 1378.92 1379.91 1410.09 1410.26 1473.01 1476.87 1569.58 1571.63 1593.90 1600.33 1710.97 1711.05 1731.68 1736.80 3244.36 3244.67 3267.08 3268.00 3274.21 3275.67 3282.54 3285.98 3294.02 3294.71 3659.04 3661.11
formula: C12H12F2N2Si
InChI: InChI=1/C12H12F2N2Si/c13-17(14,15-11-7-3-1-4-8-11)16-12-9-5-2-6-10-12/h1-10,15-16H
29 atoms
N  -1.181034 -1.922176 0.204495
C  -1.837713 -0.730089 -0.107423
C  -2.708502 -0.699641 -1.196716
C  -3.368495 0.466148 -1.545074
C  -3.173088 1.630062 -0.818222
C  -2.308728 1.603447 0.265218
C  -1.648115 0.440758 0.625243
Si -0.060867 -2.305682 1.432702
F  0.519521 -3.727784 0.964485
F  -0.703899 -2.561043 2.880648
N  1.113776 -1.105403 1.741606
C  1.822608 -0.266418 0.880248
C  1.756898 -0.399353 -0.505596
C  2.462479 0.466861 -1.323813
C  3.251019 1.473981 -0.788873
C  3.3230 1.605297 0.589151
C  2.615261 0.749209 1.415373
H  -1.456379 -2.692364 -0.386999
H  -2.871115 -1.599265 -1.77978
H  -4.039088 0.459758 -2.394389
H  -3.68526 2.54214 -1.091644
H  -2.140647 2.501252 0.845337
H  -0.980296 0.459793 1.475723
H  1.342726 -0.962021 2.714418
H  1.153006 -1.175065 -0.957224
H  2.392206 0.346594 -2.396814
H  3.800873 2.144127 -1.435146
H  3.931733 2.383455 1.030928
H  2.67792 0.873522 2.490737
totalener: -1061.42250792 hartree
nucrepener: 1306.34868922 hartree
electener: -2367.77119714 hartree
oneelecener: -4052.34673855 hartree
twoeener: 1684.57554141 hartree
kineticenergy: 1054.95951954 hartree
exchangeener: -67.274779173553 hartree
correlationener: -5.847871990997 hartree
xcener: -73.122651164550 hartree
energy: -1819.3772 -682.8558 -682.8396 -398.8730 -398.8598 -285.7111 -285.6951 -284.3604 -284.3373 -284.3230 -284.2979 -284.2883 -284.2622 -284.2137 -284.1819 -284.0870 -284.0613 -152.7741 -106.3688 -106.3306 -106.2957 -35.9839 -35.4490 -28.2310 -27.8973 -25.6815 -25.6087 -22.9098 -22.8734 -22.4379 -22.3334 -19.1431 -18.8835 -18.7930 -18.5678 -17.3591 -16.5571 -16.4056 -15.6474 -15.4551 -15.1912 -15.0657 -15.0152 -14.0973 -13.9754 -13.7290 -13.5899 -13.5412 -13.3401 -13.2350 -13.1502 -13.1041 -12.7561 -12.4275 -12.1562 -11.3741 -11.3121 -10.9292 -10.8301 -10.2403 -10.2043 -8.1107 -8.0115 -7.0899 -7.0099 0.3857 0.5072 0.7159 0.8546 2.4799 3.0420 3.3593 3.6376 4.1203 4.1601 4.8461 5.0305 5.6416 5.6549 5.6709 5.7925 6.0530 6.0942 6.5602 6.6069 6.8363 7.0275 7.7011 8.1409 8.7101 8.8815 8.9985 9.3332 9.7661 9.9198 10.0166 10.1441 11.0134 11.6383 12.3797 12.6342 13.2498 14.2770 14.3883 14.4825 14.6680 14.9806 15.2118 15.9521 15.9983 16.1208 16.2139 16.3162 16.6473 16.7606 16.8457 16.9727 17.1213 17.1818 17.2193 17.2493 17.4222 17.4963 17.8871 17.9771 18.3473 18.5097 19.0219 19.1276 19.5617 19.6993 19.9348 21.5370 22.0223 22.4457 23.2054 23.4914 24.1728 24.3836 25.0371 25.1029 25.4181 25.7612 25.8025 26.0257 26.2580 26.4724 26.6088 26.8702 27.3370 27.8719 28.0951 28.4338 28.4573 28.7845 28.8523 29.1658 29.3228 29.4778 30.1226 30.2686 30.5108 30.7749 31.0524 31.4271 31.9988 32.3348 32.5324 33.7447 33.9273 34.0692 34.3019 34.4087 35.0868 35.2249 35.3781 35.6445 35.7427 35.9482 36.4938 36.7789 37.2988 38.0239 38.3203 38.7254 38.8571 40.2125 40.3647 40.4969 40.9171 41.4515 41.7837 41.9959 42.1244 42.3126 42.5823 42.6859 42.7463 43.1511 44.4378 45.7065 46.6659 47.1869 47.3453 48.5558 49.5268 49.8673 50.6389 50.9270 51.0350 51.5268 52.6926 52.7711 54.1098 54.7639 55.2613 55.2814 56.2210 56.4051 56.8708 58.1855 58.2250 58.2852 58.6869 59.0819 59.7773 60.0172 60.1226 60.6298 60.7573 62.6564 62.7207 63.8764 64.5345 64.6624 64.8261 64.9727 65.0064 65.9118 66.0679 69.0206 69.1782 69.6395 69.8102 71.6854 71.8088 72.8464 73.2274 74.6420 74.7241 75.3616 75.4481 76.0352 76.1315 77.0514 77.1335 78.6567 78.7792 79.5599 81.1422 82.2093 82.9288 86.6975 86.7985 94.9824 95.0790 360.0098 360.1161 372.0470 372.1976 372.2771 372.3337 385.0761 385.1811 385.5225 385.6250 396.3067 396.9288 526.2624 528.9081 892.2382 893.5343 electronvolt
chargesum: -0.0000000
charge: -0.878128 0.441277 -0.316133 -0.207527 -0.244285 -0.205307 -0.300348 1.371820 -0.448023 -0.448279 -0.878077 0.439234 -0.298857 -0.204955 -0.244396 -0.206985 -0.315063 0.369878 0.208724 0.218915 0.216724 0.220320 0.237286 0.370001 0.234837 0.220963 0.217404 0.219256 0.209723
charge: -0.335367 0.032450 -0.172490 -0.121150 -0.161500 -0.116236 -0.164591 0.639794 -0.235230 -0.234956 -0.336041 0.030327 -0.163375 -0.115928 -0.160796 -0.120893 -0.172545 0.269569 0.130969 0.136657 0.135376 0.137432 0.144032 0.269857 0.143211 0.137658 0.135666 0.136791 0.131308
qa: -0.8781 0.4413 -0.3161 -0.2075 -0.2443 -0.2053 -0.3003 1.3718 -0.4480 -0.4483 -0.8781 0.4392 -0.2989 -0.2050 -0.2444 -0.2070 -0.3151 0.3699 0.2087 0.2189 0.2167 0.2203 0.2373 0.3700 0.2348 0.2210 0.2174 0.2193 0.2097
va: 2.9063 3.6036 3.8101 3.8567 3.8194 3.8579 3.8003 4.0695 0.9817 0.9814 2.9028 3.6024 3.8053 3.8557 3.8193 3.8550 3.8094 0.8401 0.9135 0.9113 0.9128 0.9111 0.9137 0.8401 0.9151 0.9109 0.9127 0.9112 0.9135
dispersion: -0.020686251 hartree
energy: -1061.394695522694 hartree
dipole: 0.43340 -0.41590 0.01749 16.32418 -15.90298 0.42119 -9.45824 9.21655 -0.24169
magnitude: 0.48593 au
magnitude: 1.23513 debye
temp: 298.15 k
press: 1.00 atm
zeropoint: 0.22916754 hartree
thermalvibcorrection: 0.01217740 hartree
thermalrotcorrection: 0.00141627 hartree
thermaltrasncorrection: 0.00141627 hartree
thermaltotal: -1061.15051804 hartree
thermalcorr: 0.01500994 hartree
nonthermalcorr: 0.22916754 hartree
totalcorr: 0.24417748 hartree
thermalcorrenthalpy: 0.00094421 hartree
totalenthalpy: -1061.14957383 hartree
vibrat: 0.02183336 hartree
rotat: 0.01580159 hartree
transl: 0.02017079 hartree
total: 0.05780574 hartree
totalentropycorr: -0.05780574 hartree
gibbsenthalpy: -1061.20737958 hartree
gibbsminuselec: 0.18731595 hartree
