program: Orca
programVersion: 5.0.4
elementType: N C C C C C C Si N C C C C C C H H H H H H H H H H H H
charge: 2
multiplicity: 1
keywords: SP DSD-BLYP D3BJ def2-QZVPP def2-QZVPP/C def2/J TightSCF
formula: C12H12N2Si
InChI: InChI=1/C12H12N2Si/c1-3-7-11(8-4-1)13-15-14-12-9-5-2-6-10-12/h1-10,13-14H
27 atoms
N  -1.10122 -1.309925 1.004375
C  -1.96276 -0.522138 0.308414
C  -3.144556 -1.117711 -0.220783
C  -3.990755 -0.380652 -1.006391
C  -3.709443 0.968028 -1.249982
C  -2.564551 1.577984 -0.699409
C  -1.70663 0.854151 0.079653
Si 0.164251 -1.062693 2.240813
N  1.289396 0.115278 1.509692
C  2.013109 0.201581 0.36171
C  3.16289 1.04331 0.352274
C  3.864178 1.234301 -0.808873
C  3.469565 0.565472 -1.972565
C  2.359047 -0.301806 -1.965227
C  1.645089 -0.497168 -0.816622
H  -1.494292 -2.245747 1.132375
H  -3.362143 -2.160786 -0.020672
H  -4.878054 -0.834663 -1.424978
H  -4.392486 1.558684 -1.846637
H  -2.384159 2.629245 -0.875299
H  -0.852882 1.339397 0.532397
H  1.753761 0.625654 2.264967
H  3.470699 1.550935 1.259461
H  4.725558 1.887385 -0.823508
H  4.039306 0.692654 -2.883942
H  2.092285 -0.833343 -2.868029
H  0.821104 -1.19701 -0.808429
totalener: -860.92693334 hartree
nucrepener: 975.78510776 hartree
electener: -1836.71204110 hartree
oneelecener: -3079.62273159 hartree
twoeener: 1242.91069049 hartree
kineticenergy: 859.12401485 hartree
exchangeener: -30.936737665929 hartree
correlationener: -2.058127054838 hartree
xcener: -32.994864720767 hartree
chargesum: 2.0000000
charge: -0.384681 0.272484 -0.013547 -0.078238 0.006901 -0.065588 0.004820 0.641282 -0.385161 0.274040 -0.017520 -0.077927 0.010939 -0.063874 0.004503 0.228972 0.126829 0.157512 0.173301 0.152552 0.099324 0.229090 0.126477 0.155883 0.170565 0.151835 0.099228
charge: 0.508259 -0.193572 0.157910 0.137343 0.216736 0.137837 0.126420 0.365324 0.507694 -0.193238 0.157413 0.137222 0.216174 0.137506 0.126114 -0.123600 -0.029806 -0.025880 -0.019908 -0.029211 -0.043659 -0.123749 -0.029860 -0.025912 -0.020080 -0.029303 -0.044174
qa: -0.3847 0.2725 -0.0135 -0.0782 0.0069 -0.0656 0.0048 0.6413 -0.3852 0.2740 -0.0175 -0.0779 0.0109 -0.0639 0.0045 0.2290 0.1268 0.1575 0.1733 0.1526 0.0993 0.2291 0.1265 0.1559 0.1706 0.1518 0.0992
va: 3.2232 3.5495 3.7629 3.8334 3.7866 3.8059 3.6851 2.4038 3.2242 3.5442 3.7626 3.8349 3.7884 3.8085 3.6803 0.9874 0.9855 0.9734 0.9616 0.9728 0.9981 0.9870 0.9855 0.9735 0.9626 0.9731 0.9968
total: -862.198557754 hartree
dispersion: -0.024344460 hartree
energy: -862.222902213363 hartree
dipole: -0.44110 0.43389 -0.00721 2.88009 -2.91836 -0.03827 -6.08269 6.15707 0.07438
magnitude: 0.08396 au
magnitude: 0.21340 debye
