program: Gaussian 09
title: 000076350
version: EM64L-G09RevD.01
frameworkgroup: C1[X(C7H14O6P2)]
method: RPBEPBE
basis: SDD
operation: Freq
keyword: #p
keyword: freq=noraman
keyword: PBEPBE/SDD
title: #p freq=noraman PBEPBE/SDD
converged: YES YES NO NO
title: Mulliken charges:
elementType: P P O O O O O O C C C C C C C H H H H H H H H H H H H H H
charge: 1.286880 1.286881 -0.474775 -0.478463 -0.478468 -0.474771 -0.579702 -0.579700 0.172862 -0.361756 -0.320807 -0.320794 -0.361775 -0.904879 -0.904879 0.239748 0.200693 0.195560 0.288640 0.195557 0.288637 0.239753 0.200693 0.288421 0.242290 0.291722 0.288423 0.242288 0.291721
chargesum: 0.00000
title: Mulliken charges with hydrogens summed into heavy atoms:
elementType: P P O O O O O O C C C C C C C
charge: 1.286880 1.286881 -0.474775 -0.478463 -0.478468 -0.474771 -0.579702 -0.579700 0.172862 0.078686 0.163392 0.163400 0.078671 -0.082447 -0.082447
polarizability: 1.73274372e+02 9.90426739e-06 1.20597352e+02 -1.30019659e+00 9.51419557e-07 1.15923253e+02
1716.lowfreq: -7.9374 -0.0010 -0.0008 0.0011 12.9352 14.0215 38.1329 45.2453 87.6793
frequency: 38.1211 45.1726 87.6448 107.7933 110.8370 165.0142 165.4338 181.9490 185.3694 221.3245 221.8318 234.2150 244.3445 261.6848 263.0326 289.3936 342.3942 344.8664 366.5751 374.6049 378.1576 398.7779 460.3515 507.1857 549.2825 573.3156 597.5450 618.4896 666.8617 711.2828 711.4340 770.5267 888.4791 901.8776 928.1270 929.9006 932.2447 935.2936 947.4745 950.3596 962.2069 967.7124 987.0815 1022.7042 1094.0330 1098.4116 1120.1968 1152.9856 1154.6440 1206.8787 1210.5904 1268.7409 1322.7445 1330.3281 1338.4447 1341.6400 1341.9051 1357.5960 1374.5127 1428.9641 1429.2271 1435.7739 1436.1960 1450.9219 1450.9592 1458.5524 1469.7578 2942.0222 2946.3542 2962.6058 2966.8400 3016.0253 3016.0312 3048.7417 3053.7415 3105.0055 3105.1931 3131.8637 3131.8722 3143.4061 3143.4089
redmass: 5.9671 5.2304 5.1363 3.3932 5.1615 1.0718 1.0685 3.2771 2.7418 5.4818 4.7898 2.8723 3.6863 5.6685 5.7197 3.7547 8.7599 8.6760 3.4448 2.4449 3.8156 4.5518 6.7538 6.5254 7.2793 5.8193 6.5060 7.0864 4.4892 6.7597 6.9902 3.8080 2.5197 2.0870 2.4691 1.7377 1.4882 1.7858 1.5585 1.6795 2.8854 6.8739 2.7597 3.7198 8.1893 8.1618 3.4687 1.9733 1.7036 1.0948 1.0555 1.4721 1.6720 1.2165 1.1767 1.1752 1.1627 1.2910 1.2709 1.0460 1.0455 1.0497 1.0494 1.0745 1.0731 1.0789 1.0882 1.0649 1.0677 1.0677 1.0694 1.0319 1.0319 1.0962 1.0979 1.0952 1.0958 1.1017 1.1017 1.1021 1.1021
irintensity: 0.1754 5.4932 7.0233 0.4653 2.1785 0.5952 0.0001 2.8358 3.9952 0.4974 0.0668 0.1709 0.8994 1.4825 2.3956 0.9493 136.0535 9.2950 7.0359 2.8454 15.1011 4.2955 2.6760 6.0525 28.6512 10.2906 59.2296 91.7191 45.8941 289.3107 3.4019 0.0137 12.2527 10.1292 17.1553 6.0259 13.5694 12.6754 31.5195 90.3914 3.3619 408.6001 7.3613 65.1238 257.5283 114.2248 26.6832 1.6935 5.8159 2.1345 0.1498 3.4280 5.6163 0.7523 0.3571 33.6725 15.0031 19.7166 3.7430 12.2772 12.2383 9.7884 2.5090 2.8311 1.2595 18.0427 16.4510 5.7979 74.0208 70.9549 27.5642 3.2066 4.0635 7.7422 33.6395 2.6243 1.6017 5.2600 5.5813 0.2944 0.1949
temp: 298.150 k
press: 1.00000 atm
elementType: 15 15 8 8 8 8 8 8 6 6 6 6 6 6 6 1 1 1 1 1 1 1 1 1 1 1 1 1 1
symmnumber: 1
zpe: 571428.5 jmol-1
zpe.correction: 0.217646 hartree
zpe.thermalcorrener: 0.234675 hartree
zpe.thermalcorrenthalpy: 0.235620 hartree
zpe.thermalcorrgfe: 0.173422 hartree
zpe.sumelectzpe: -1407.693226 hartree
zpe.sumelectthermal: -1407.676197 hartree
zpe.sumelectthermalent: -1407.675252 hartree
zpe.sumelectthermalfe: -1407.737450 hartree
dipole: 0.0000 8.7669 0.0004
dipole: 8.7669
quadrupole: -113.6614 -111.5449 -106.6422
quadrupole: -0.0017 29.0395 -0.0003
quadrupole: -3.0452 -0.9287 3.9739 -0.0017 29.0395 -0.0003
hfenergy: -1407.910872 hartree
pointgroup: C01 [X(C7H14O6P2)]
dipole: 0.0000514 -3.44918 -0.0009545 debye
polarizability: 173.3032071|0.0005836|120.5973518|-0.1896169|0.0015048|115.8944185 unknown
InChI: InChI=1S/C7H14O6P2/c1-14(8)10-3-7(4-11-14)5-12-15(2,9)13-6-7/h3-6H2,1-2H3
charge 0 multiplicity 1
29 atoms
P  -3.037587 0.408896 -0.041584
P  3.037486 0.408946 0.04179
O  -2.295973 -0.83967 -1.046965
O  -1.646521 1.102288 0.764475
O  1.646429 1.102746 -0.763922
O  2.295866 -0.84017 1.046491
O  -3.84197 1.459725 -0.901242
O  3.841845 1.459322 0.902024
C  -0.000037 -0.649272 -0.000213
C  -1.13705 -1.577503 -0.506501
C  -0.520154 0.227485 1.169674
C  0.520056 0.228173 -1.169598
C  1.137006 -1.577756 0.505538
C  -3.997155 -0.500832 1.269465
C  3.997065 -0.500081 -1.269735
H  -0.802641 -2.203112 -1.353247
H  -1.460318 -2.250132 0.318342
H  -0.82526 -0.420572 2.019381
H  0.2494 0.932054 1.519143
H  0.82515 -0.419395 -2.019683
H  -0.249514 0.932939 -1.518636
H  0.802616 -2.203907 1.35189
H  1.460342 -2.249859 -0.319707
H  -4.833577 -1.029831 0.786874
H  -3.356285 -1.222921 1.800139
H  -4.391189 0.237618 1.985135
H  4.833541 -1.029262 -0.787438
H  3.356207 -1.221952 -1.800716
H  4.391018 0.238734 -1.985073
