program: Orca
programVersion: 5.0.4
elementType: N C C C C C C Si F N C C C C C C C C C C C C H H H H H H H H H H H H H H H H
charge: 1
multiplicity: 1
keywords: SP DSD-BLYP D3BJ def2-QZVPP def2-QZVPP/C def2/J TightSCF
formula: C18H16FN2Si
InChI: InChI=1/C18H16FN2Si/c19-22(20-16-10-4-1-5-11-16)21(17-12-6-2-7-13-17)18-14-8-3-9-15-18/h1-15,20H
38 atoms
N  1.825313 -0.318915 -1.694387
C  2.347032 -1.131343 -0.634528
C  2.544634 -0.58364 0.623086
C  2.987114 -1.394184 1.656741
C  3.256824 -2.733917 1.424973
C  3.083396 -3.267049 0.15565
C  2.616433 -2.470842 -0.87737
Si 0.406826 0.527989 -1.653414
F  0.107521 1.382285 -2.939036
N  -0.695761 0.589386 -0.424856
C  -1.681278 1.636685 -0.401123
C  -1.277887 2.961934 -0.350192
C  -2.235381 3.96569 -0.343652
C  -3.581399 3.637888 -0.368509
C  -3.974556 2.305992 -0.402029
C  -3.026657 1.297764 -0.42507
C  -0.663961 -0.359484 0.651276
C  -0.655843 0.099513 1.961478
C  -0.569807 -0.816725 2.995373
C  -0.475224 -2.17567 2.724101
C  -0.492875 -2.623864 1.413554
C  -0.606186 -1.716117 0.371742
H  2.352908 -0.335966 -2.560087
H  2.36869 0.47062 0.7996
H  3.132126 -0.971756 2.641205
H  3.612173 -3.361363 2.230697
H  3.303869 -4.309118 -0.031114
H  2.455542 -2.893503 -1.86123
H  -0.225676 3.21846 -0.288179
H  -1.925973 5.000888 -0.306628
H  -4.32723 4.420531 -0.356977
H  -5.025165 2.051453 -0.418954
H  -3.328386 0.258707 -0.455887
H  -0.717476 1.159602 2.171105
H  -0.570718 -0.466682 4.018573
H  -0.400731 -2.884991 3.536814
H  -0.435636 -3.681485 1.197632
H  -0.661913 -2.074468 -0.650684
totalener: -1191.52425887 hartree
nucrepener: 1884.75752738 hartree
electener: -3076.28178625 hartree
oneelecener: -5353.70799120 hartree
twoeener: 2277.42620494 hartree
kineticenergy: 1188.88477061 hartree
exchangeener: -44.341644227051 hartree
correlationener: -3.003374008588 hartree
xcener: -47.345018235640 hartree
chargesum: 1.0000000
charge: -0.436558 0.267997 -0.056620 -0.088179 -0.099481 -0.090114 -0.128859 0.875562 -0.338704 -0.218733 0.236857 -0.075217 -0.096924 -0.113652 -0.084060 -0.118997 0.240309 -0.115126 -0.114816 -0.113223 -0.108604 -0.071156 0.230940 0.085303 0.115947 0.113490 0.115027 0.108432 0.073621 0.113738 0.118074 0.119034 0.111065 0.117238 0.121270 0.113148 0.115020 0.076948
charge: 0.530032 -0.228338 0.080810 0.095300 0.092619 0.091149 0.082871 -0.104256 0.342668 0.388287 -0.220783 0.077245 0.093529 0.097854 0.097972 0.098544 -0.221384 0.094856 0.093663 0.094175 0.094993 0.079463 -0.136020 -0.049341 -0.048002 -0.048684 -0.047867 -0.050712 -0.051024 -0.047699 -0.046713 -0.046615 -0.042972 -0.044010 -0.047641 -0.048550 -0.047791 -0.047625
qa: -0.4366 0.2680 -0.0566 -0.0882 -0.0995 -0.0901 -0.1289 0.8756 -0.3387 -0.2187 0.2369 -0.0752 -0.0969 -0.1137 -0.0841 -0.1190 0.2403 -0.1151 -0.1148 -0.1132 -0.1086 -0.0712 0.2309 0.0853 0.1159 0.1135 0.1150 0.1084 0.0736 0.1137 0.1181 0.1190 0.1111 0.1172 0.1213 0.1131 0.1150 0.0769
va: 3.1509 3.4305 3.7397 3.8294 3.8570 3.8380 3.8043 4.3855 1.0965 2.9158 3.5041 3.7475 3.8196 3.8534 3.8004 3.7826 3.5276 3.7596 3.7999 3.8548 3.8276 3.7181 0.9927 0.9871 0.9789 0.9862 0.9831 0.9863 0.9964 0.9815 0.9799 0.9778 0.9939 0.9909 0.9772 0.9832 0.9783 0.9875
total: -1193.404565236 hartree
dispersion: -0.039197000 hartree
energy: -1193.443762236096 hartree
dipole: -0.48583 0.98811 0.50228 -5.43635 5.29152 -0.14484 11.87377 -12.42892 -0.55515
magnitude: 0.76253 au
magnitude: 1.93821 debye
