program: Orca
programVersion: 5.0.4
elementType: F Si N C C C C C C C C C C C C F N C C C C C C C C C C C C H H H H H H H H H H H H H H H H H H H H
charge: 0
multiplicity: 1
keywords: Freq RIJCOSX PBEh-3c
frequency: 0.00 0.00 0.00 0.00 0.00 0.00 19.77 25.80 33.47 36.72 45.08 63.85 66.00 74.72 81.01 84.91 112.35 119.89 163.34 189.66 232.27 242.90 254.14 259.37 262.56 271.37 290.01 325.52 327.51 409.77 431.76 433.05 433.49 434.36 462.94 485.66 490.43 544.36 550.36 558.18 577.87 623.46 627.34 642.44 643.26 650.92 651.81 711.30 732.51 735.16 735.84 736.69 745.70 799.70 802.95 805.02 806.54 880.07 881.26 882.14 884.46 893.46 928.33 936.37 956.24 957.92 959.56 969.11 974.68 1019.82 1020.70 1021.18 1021.24 1040.29 1041.21 1045.13 1045.15 1045.51 1045.79 1047.17 1047.79 1061.84 1066.56 1089.97 1090.95 1094.81 1095.89 1142.76 1143.66 1145.15 1147.48 1213.97 1214.19 1215.05 1215.53 1238.43 1238.93 1240.03 1242.97 1301.56 1314.14 1348.83 1351.20 1371.96 1373.73 1380.25 1382.53 1401.83 1402.30 1405.34 1407.61 1534.58 1534.97 1540.39 1541.66 1587.60 1588.04 1588.39 1590.26 1701.50 1701.64 1707.22 1707.77 1720.34 1720.71 1727.95 1731.38 3259.38 3261.97 3265.11 3265.16 3268.22 3269.39 3271.97 3272.07 3276.01 3276.69 3280.45 3280.62 3284.30 3284.43 3289.94 3290.01 3292.24 3292.40 3297.56 3297.75
frequency: 19.77 25.80 33.47 36.72 45.08 63.85 66.00 74.72 81.01 84.91 112.35 119.89 163.34 189.66 232.27 242.90 254.14 259.37 262.56 271.37 290.01 325.52 327.51 409.77 431.76 433.05 433.49 434.36 462.94 485.66 490.43 544.36 550.36 558.18 577.87 623.46 627.34 642.44 643.26 650.92 651.81 711.30 732.51 735.16 735.84 736.69 745.70 799.70 802.95 805.02 806.54 880.07 881.26 882.14 884.46 893.46 928.33 936.37 956.24 957.92 959.56 969.11 974.68 1019.82 1020.70 1021.18 1021.24 1040.29 1041.21 1045.13 1045.15 1045.51 1045.79 1047.17 1047.79 1061.84 1066.56 1089.97 1090.95 1094.81 1095.89 1142.76 1143.66 1145.15 1147.48 1213.97 1214.19 1215.05 1215.53 1238.43 1238.93 1240.03 1242.97 1301.56 1314.14 1348.83 1351.20 1371.96 1373.73 1380.25 1382.53 1401.83 1402.30 1405.34 1407.61 1534.58 1534.97 1540.39 1541.66 1587.60 1588.04 1588.39 1590.26 1701.50 1701.64 1707.22 1707.77 1720.34 1720.71 1727.95 1731.38 3259.38 3261.97 3265.11 3265.16 3268.22 3269.39 3271.97 3272.07 3276.01 3276.69 3280.45 3280.62 3284.30 3284.43 3289.94 3290.01 3292.24 3292.40 3297.56 3297.75
formula: C24H20F2N2Si
InChI: InChI=1/C24H20F2N2Si/c25-29(26,27(21-13-5-1-6-14-21)22-15-7-2-8-16-22)28(23-17-9-3-10-18-23)24-19-11-4-12-20-24/h1-20H
49 atoms
F  -0.138697 0.425509 -3.00962
Si 0.166602 -0.461517 -1.707481
N  1.359689 0.341973 -0.771367
C  2.221544 1.357134 -1.265532
C  1.720712 2.531839 -1.813266
C  2.588854 3.509905 -2.276912
C  3.959811 3.335309 -2.180847
C  4.462024 2.169231 -1.619726
C  3.600208 1.183339 -1.171263
C  1.522714 -0.030428 0.587078
C  1.603449 -1.369398 0.95482
C  1.678594 -1.721911 2.294906
C  1.705351 -0.744636 3.275767
C  1.655673 0.593158 2.906846
C  1.557664 0.95098 1.574521
F  0.661673 -1.868619 -2.303186
N  -1.212626 -0.748465 -0.727923
C  -2.087263 -1.856265 -0.888258
C  -3.440537 -1.625675 -1.123741
C  -4.315402 -2.688414 -1.268778
C  -3.849178 -3.993903 -1.194898
C  -2.503799 -4.225449 -0.958153
C  -1.625794 -3.16374 -0.793957
C  -1.538684 0.183763 0.290528
C  -1.720365 -0.257878 1.598391
C  -1.971473 0.651092 2.609971
C  -2.032125 2.011088 2.335166
C  -1.861155 2.451964 1.03315
C  -1.629857 1.542247 0.010705
H  0.653174 2.692936 -1.863765
H  2.186619 4.418729 -2.704809
H  4.633402 4.103512 -2.536145
H  5.530938 2.022365 -1.538302
H  3.991263 0.271435 -0.738518
H  1.630098 -2.14084 0.195441
H  1.735206 -2.767679 2.567476
H  1.771956 -1.021183 4.31945
H  1.672028 1.365622 3.664232
H  1.485703 1.993396 1.293669
H  -3.801961 -0.607347 -1.189123
H  -5.364574 -2.495709 -1.450334
H  -4.531864 -4.823974 -1.317286
H  -2.13156 -5.239073 -0.889693
H  -0.584118 -3.354697 -0.578182
H  -1.639891 -1.31377 1.820397
H  -2.099037 0.296213 3.624015
H  -2.216865 2.720134 3.13104
H  -1.922127 3.507927 0.804475
H  -1.535796 1.88967 -1.010878
totalener: -1522.49723362 hartree
nucrepener: 2981.64214694 hartree
electener: -4504.13938055 hartree
oneelecener: -8014.46386182 hartree
twoeener: 3510.32448126 hartree
kineticenergy: 1512.40025110 hartree
exchangeener: -103.569896856882 hartree
correlationener: -9.349507589549 hartree
xcener: -112.919404446431 hartree
chargesum: 0.0000000
charge: -0.440012 1.413827 -0.790506 0.317265 -0.268606 -0.219171 -0.227558 -0.216712 -0.246782 0.322688 -0.308309 -0.226386 -0.231153 -0.211128 -0.223452 -0.441343 -0.791476 0.319453 -0.246262 -0.216772 -0.228043 -0.218207 -0.271469 0.319239 -0.220145 -0.209276 -0.230867 -0.225728 -0.303047 0.225122 0.220882 0.220480 0.222134 0.237232 0.238914 0.220181 0.217616 0.219877 0.239993 0.235788 0.221869 0.220504 0.220883 0.227698 0.237522 0.219986 0.218104 0.220139 0.235015
charge: -0.226589 0.660476 -0.196687 0.019477 -0.140572 -0.129340 -0.140693 -0.128503 -0.131812 0.024444 -0.157389 -0.130816 -0.145879 -0.121924 -0.125936 -0.228317 -0.198263 0.019048 -0.132063 -0.128497 -0.140752 -0.129239 -0.141112 0.022727 -0.123170 -0.122003 -0.143952 -0.131447 -0.155170 0.141054 0.137469 0.136689 0.138016 0.146907 0.144066 0.136594 0.135306 0.137186 0.149440 0.146416 0.137880 0.136629 0.137474 0.142499 0.148859 0.137405 0.135484 0.136680 0.141897
qa: -0.4400 1.4138 -0.7905 0.3173 -0.2686 -0.2192 -0.2276 -0.2167 -0.2468 0.3227 -0.3083 -0.2264 -0.2312 -0.2111 -0.2235 -0.4413 -0.7915 0.3195 -0.2463 -0.2168 -0.2280 -0.2182 -0.2715 0.3192 -0.2201 -0.2093 -0.2309 -0.2257 -0.3030 0.2251 0.2209 0.2205 0.2221 0.2372 0.2389 0.2202 0.2176 0.2199 0.2400 0.2358 0.2219 0.2205 0.2209 0.2277 0.2375 0.2200 0.2181 0.2201 0.2350
va: 0.9978 3.9899 2.9190 3.6963 3.8298 3.8216 3.8149 3.8186 3.8009 3.6880 3.8223 3.8316 3.8195 3.8340 3.7954 0.9948 2.9141 3.6915 3.8019 3.8189 3.8153 3.8200 3.8294 3.6867 3.7991 3.8308 3.8196 3.8284 3.8271 0.9145 0.9113 0.9114 0.9109 0.9085 0.9126 0.9119 0.9122 0.9118 0.9104 0.9091 0.9110 0.9114 0.9112 0.9142 0.9121 0.9119 0.9120 0.9120 0.9120
dispersion: -0.044439243 hartree
energy: -1522.465500555435 hartree
dipole: -1.52286 1.43138 -0.09148 4.25194 -3.96796 0.28398 15.68185 -14.66696 1.01489
magnitude: 1.05784 au
magnitude: 2.68881 debye
temp: 298.15 k
press: 1.00 atm
zeropoint: 0.39532860 hartree
thermalvibcorrection: 0.02110692 hartree
thermalrotcorrection: 0.00141627 hartree
thermaltrasncorrection: 0.00141627 hartree
thermaltotal: -1522.04623249 hartree
thermalcorr: 0.02393946 hartree
nonthermalcorr: 0.39532860 hartree
totalcorr: 0.41926807 hartree
thermalcorrenthalpy: 0.00094421 hartree
totalenthalpy: -1522.04528828 hartree
vibrat: 0.03762208 hartree
rotat: 0.01693478 hartree
transl: 0.02084351 hartree
total: 0.07540036 hartree
totalentropycorr: -0.07540036 hartree
gibbsenthalpy: -1522.12068864 hartree
gibbsminuselec: 0.34481191 hartree
