program: Orca
programVersion: 5.0.4
elementType: F Si N C C C C C C C C C C C C F N C C C C C C C C C C C C H H H H H H H H H H H H H H H H H H H H
charge: 0
multiplicity: 1
keywords: Opt RIJCOSX PBEh-3c
formula: C24H20F2N2Si
InChI: InChI=1/C24H20F2N2Si/c25-29(26,27(21-13-5-1-6-14-21)22-15-7-2-8-16-22)28(23-17-9-3-10-18-23)24-19-11-4-12-20-24/h1-20H
49 atoms
F  -0.138697 0.425509 -3.00962
Si 0.166602 -0.461517 -1.707481
N  1.359689 0.341973 -0.771367
C  2.221544 1.357134 -1.265532
C  1.720712 2.531839 -1.813266
C  2.588854 3.509905 -2.276912
C  3.959811 3.335309 -2.180847
C  4.462024 2.169231 -1.619726
C  3.600208 1.183339 -1.171263
C  1.522714 -0.030428 0.587078
C  1.603449 -1.369398 0.95482
C  1.678594 -1.721911 2.294906
C  1.705352 -0.744636 3.275767
C  1.655673 0.593158 2.906846
C  1.557664 0.95098 1.574521
F  0.661673 -1.868619 -2.303186
N  -1.212626 -0.748465 -0.727923
C  -2.087263 -1.856265 -0.888258
C  -3.440537 -1.625675 -1.123741
C  -4.315402 -2.688414 -1.268778
C  -3.849178 -3.993903 -1.194898
C  -2.503799 -4.225449 -0.958153
C  -1.625794 -3.16374 -0.793957
C  -1.538684 0.183763 0.290528
C  -1.720365 -0.257878 1.598391
C  -1.971473 0.651092 2.609971
C  -2.032125 2.011088 2.335166
C  -1.861155 2.451964 1.03315
C  -1.629857 1.542247 0.010705
H  0.653174 2.692936 -1.863765
H  2.186619 4.418729 -2.704809
H  4.633402 4.103512 -2.536145
H  5.530938 2.022365 -1.538302
H  3.991263 0.271435 -0.738518
H  1.630098 -2.14084 0.195441
H  1.735206 -2.767679 2.567476
H  1.771956 -1.021183 4.31945
H  1.672028 1.365622 3.664232
H  1.485703 1.993396 1.293669
H  -3.801961 -0.607347 -1.189123
H  -5.364574 -2.495709 -1.450334
H  -4.531864 -4.823974 -1.317286
H  -2.13156 -5.239073 -0.889693
H  -0.584118 -3.354697 -0.578182
H  -1.639891 -1.31377 1.820397
H  -2.099037 0.296213 3.624015
H  -2.216865 2.720134 3.13104
H  -1.922127 3.507927 0.804475
H  -1.535796 1.88967 -1.010878
totalener: -1522.49730999 hartree
nucrepener: 2981.03863767 hartree
electener: -4503.53594766 hartree
oneelecener: -8013.24929991 hartree
twoeener: 3509.71335225 hartree
kineticenergy: 1512.39695798 hartree
exchangeener: -103.569545862138 hartree
correlationener: -9.349487223913 hartree
xcener: -112.919033086052 hartree
dispersion: -0.044418501 hartree
dispersion: -0.044427102 hartree
dispersion: -0.044417175 hartree
dispersion: -0.044485404 hartree
dispersion: -0.044400508 hartree
dispersion: -0.044427200 hartree
dispersion: -0.044437485 hartree
chargesum: -0.0000000
charge: -0.439997 1.413785 -0.790545 0.317222 -0.268527 -0.219220 -0.227579 -0.216719 -0.246685 0.322652 -0.308256 -0.226410 -0.231162 -0.211130 -0.223347 -0.441338 -0.791507 0.319423 -0.246157 -0.216785 -0.228061 -0.218242 -0.271408 0.319202 -0.220053 -0.209276 -0.230876 -0.225756 -0.302987 0.225118 0.220878 0.220483 0.222128 0.237207 0.238900 0.220174 0.217609 0.219864 0.239973 0.235767 0.221861 0.220501 0.220882 0.227683 0.237503 0.219973 0.218104 0.220135 0.234998
charge: -0.226576 0.660440 -0.196716 0.019452 -0.140523 -0.129371 -0.140710 -0.128513 -0.131739 0.024412 -0.157344 -0.130842 -0.145879 -0.121927 -0.125860 -0.228314 -0.198283 0.019026 -0.131989 -0.128508 -0.140767 -0.129268 -0.141068 0.022692 -0.123098 -0.122008 -0.143954 -0.131469 -0.155130 0.141045 0.137469 0.136689 0.138013 0.146895 0.144056 0.136591 0.135303 0.137179 0.149427 0.146403 0.137876 0.136628 0.137474 0.142490 0.148848 0.137399 0.135481 0.136678 0.141888
qa: -0.4400 1.4138 -0.7905 0.3172 -0.2685 -0.2192 -0.2276 -0.2167 -0.2467 0.3227 -0.3083 -0.2264 -0.2312 -0.2111 -0.2233 -0.4413 -0.7915 0.3194 -0.2462 -0.2168 -0.2281 -0.2182 -0.2714 0.3192 -0.2201 -0.2093 -0.2309 -0.2258 -0.3030 0.2251 0.2209 0.2205 0.2221 0.2372 0.2389 0.2202 0.2176 0.2199 0.2400 0.2358 0.2219 0.2205 0.2209 0.2277 0.2375 0.2200 0.2181 0.2201 0.2350
va: 0.9978 3.9900 2.9190 3.6963 3.8298 3.8216 3.8149 3.8186 3.8009 3.6880 3.8223 3.8316 3.8195 3.8340 3.7954 0.9948 2.9141 3.6915 3.8019 3.8189 3.8153 3.8200 3.8295 3.6867 3.7991 3.8308 3.8196 3.8284 3.8271 0.9145 0.9113 0.9114 0.9109 0.9085 0.9126 0.9119 0.9122 0.9119 0.9104 0.9091 0.9110 0.9114 0.9112 0.9142 0.9121 0.9119 0.9120 0.9120 0.9120
dispersion: -0.044439243 hartree
energy: -1522.465500431885 hartree
dipole: -1.52286 1.43137 -0.09149 4.25194 -3.96788 0.28407 15.68185 -14.66665 1.01520
magnitude: 1.05816 au
magnitude: 2.68963 debye
