program: Orca
programVersion: 5.0.4
elementType: O Si N C C C C C C C C C C C C N C C C C C C C C C C C C H H H H H H H H H H H H H H H H H H H H
charge: 0
multiplicity: 1
keywords: Opt RIJCOSX PBEh-3c
formula: C24H20N2OSi
InChI: InChI=1/C24H20N2OSi/c27-28(25(21-13-5-1-6-14-21)22-15-7-2-8-16-22)26(23-17-9-3-10-18-23)24-19-11-4-12-20-24/h1-20H
48 atoms
O  -0.555903 -3.143842 -0.650515
Si -0.297403 -1.678008 -0.356011
N  1.165702 -1.01553 0.249243
C  1.550651 0.310194 -0.075902
C  1.871539 1.212356 0.9337
C  2.217871 2.512413 0.614625
C  2.237668 2.930577 -0.709624
C  1.923236 2.03215 -1.716071
C  1.592659 0.721709 -1.401887
C  2.065786 -1.797946 1.013597
C  1.589564 -2.691559 1.967289
C  2.470759 -3.473231 2.6968
C  3.838243 -3.356418 2.503943
C  4.315277 -2.454897 1.563334
C  3.440018 -1.686043 0.815016
N  -1.413383 -0.388289 -0.55858
C  -1.395798 0.72153 0.323773
C  -1.335985 2.016469 -0.18186
C  -1.286877 3.094634 0.68279
C  -1.28547 2.893909 2.057417
C  -1.34952 1.605506 2.56219
C  -1.41827 0.521766 1.698467
C  -2.437922 -0.451832 -1.53302
C  -3.721608 0.003787 -1.241465
C  -4.719527 -0.070919 -2.198368
C  -4.46131 -0.61356 -3.448805
C  -3.185811 -1.07215 -3.737537
C  -2.176489 -0.980117 -2.793062
H  1.834925 0.891839 1.966225
H  2.459285 3.208958 1.406346
H  2.502832 3.950424 -0.954233
H  1.94852 2.343375 -2.752039
H  1.381298 0.012514 -2.194075
H  0.525318 -2.7856 2.145967
H  2.081177 -4.169896 3.426984
H  4.525274 -3.961256 3.080154
H  5.380104 -2.35602 1.398376
H  3.824685 -0.998205 0.073471
H  -1.313236 2.169103 -1.252423
H  -1.231916 4.097517 0.280985
H  -1.239568 3.739567 2.730476
H  -1.36214 1.439126 3.631241
H  -1.506921 -0.482519 2.09732
H  -3.941471 0.412461 -0.263941
H  -5.712099 0.28587 -1.956953
H  -5.246487 -0.678554 -4.18972
H  -2.966264 -1.496045 -4.70826
H  -1.180912 -1.325316 -3.045579
totalener: -1398.10985961 hartree
nucrepener: 2700.66442209 hartree
electener: -4098.77428170 hartree
oneelecener: -7277.24109790 hartree
twoeener: 3178.46681620 hartree
kineticenergy: 1388.88709872 hartree
exchangeener: -96.859813977446 hartree
correlationener: -8.858013503103 hartree
xcener: -105.717827480549 hartree
dispersion: -0.043754662 hartree
dispersion: -0.043713292 hartree
dispersion: -0.043766494 hartree
dispersion: -0.043748042 hartree
dispersion: -0.043753823 hartree
dispersion: -0.043734814 hartree
dispersion: -0.043745418 hartree
chargesum: -0.0000000
charge: -0.574946 0.996641 -0.786287 0.297301 -0.215971 -0.208842 -0.228006 -0.228851 -0.277617 0.381376 -0.290020 -0.214479 -0.235393 -0.211538 -0.268335 -0.787852 0.298468 -0.216145 -0.209067 -0.227867 -0.227955 -0.281101 0.385003 -0.269488 -0.211608 -0.235471 -0.213672 -0.293073 0.241830 0.223047 0.221921 0.225288 0.227530 0.226438 0.224198 0.220336 0.221725 0.244465 0.242321 0.223064 0.221858 0.225315 0.229315 0.244797 0.222139 0.220485 0.224175 0.224546
charge: -0.426418 0.562459 -0.186247 0.014831 -0.119970 -0.121433 -0.139103 -0.130994 -0.146639 0.031067 -0.142365 -0.122850 -0.145592 -0.125046 -0.143700 -0.186919 0.014889 -0.120162 -0.121223 -0.139085 -0.130540 -0.147428 0.031488 -0.144092 -0.124552 -0.145858 -0.122368 -0.143772 0.149867 0.138760 0.137099 0.138993 0.140780 0.143094 0.139160 0.136844 0.137774 0.148311 0.149969 0.138797 0.137111 0.139095 0.141407 0.148474 0.137926 0.136918 0.139224 0.142020
qa: -0.5749 0.9966 -0.7863 0.2973 -0.2160 -0.2088 -0.2280 -0.2289 -0.2776 0.3814 -0.2900 -0.2145 -0.2354 -0.2115 -0.2683 -0.7879 0.2985 -0.2161 -0.2091 -0.2279 -0.2280 -0.2811 0.3850 -0.2695 -0.2116 -0.2355 -0.2137 -0.2931 0.2418 0.2230 0.2219 0.2253 0.2275 0.2264 0.2242 0.2203 0.2217 0.2445 0.2423 0.2231 0.2219 0.2253 0.2293 0.2448 0.2221 0.2205 0.2242 0.2245
va: 2.1744 4.2736 2.9474 3.6882 3.7943 3.8276 3.8158 3.8279 3.8384 3.6452 3.8350 3.8472 3.8168 3.8314 3.7919 2.9473 3.6895 3.7937 3.8279 3.8157 3.8285 3.8372 3.6433 3.7922 3.8319 3.8169 3.8487 3.8362 0.9096 0.9110 0.9108 0.9102 0.9099 0.9099 0.9098 0.9115 0.9109 0.9033 0.9095 0.9111 0.9109 0.9102 0.9088 0.9032 0.9107 0.9115 0.9098 0.9100
dispersion: -0.043745584 hartree
energy: -1398.085307796040 hartree
dipole: 1.50434 -1.14889 0.35545 8.48371 -6.41060 2.07310 1.81082 -1.37433 0.43649
magnitude: 2.14817 au
magnitude: 5.46021 debye
