program: Orca
programVersion: 5.0.4
elementType: F N F Si N C C C C O H H H H
charge: 0
multiplicity: 1
keywords: Freq RIJCOSX PBEh-3c
frequency: 0.00 0.00 0.00 0.00 0.00 0.00 33.38 63.18 108.93 119.51 161.54 189.53 292.31 337.56 373.41 511.72 538.60 631.14 644.79 690.29 754.93 789.03 901.08 923.44 963.19 984.41 1023.36 1094.73 1135.34 1142.44 1162.08 1265.48 1298.13 1352.01 1367.11 1497.40 1572.80 1667.78 3333.63 3342.37 3356.11 3364.36
frequency: 33.38 63.18 108.93 119.51 161.54 189.53 292.31 337.56 373.41 511.72 538.60 631.14 644.79 690.29 754.93 789.03 901.08 923.44 963.19 984.41 1023.36 1094.73 1135.34 1142.44 1162.08 1265.48 1298.13 1352.01 1367.11 1497.40 1572.80 1667.78 3333.63 3342.37 3356.11 3364.36
formula: C4H4F2N2OSi
InChI: InChI=1/C4H4F2N2OSi/c5-8(6)10(9)7-3-1-2-4-7/h1-4H
14 atoms
F  3.715257 1.097828 -0.076742
N  2.355251 1.12678 -0.202817
F  2.131794 1.069983 -1.578131
Si 1.709422 -0.458166 0.370124
N  0.020697 -0.225871 0.367669
C  -0.720389 0.890003 -0.006494
C  -2.035774 0.590784 0.12047
C  -2.132509 -0.753823 0.591139
C  -0.871966 -1.228909 0.733933
O  2.478252 -1.680195 0.81015
H  -0.244333 1.802219 -0.322644
H  -2.854038 1.256921 -0.09832
H  -3.038184 -1.298849 0.799892
H  -0.513379 -2.188805 1.066972
totalener: -827.15824635 hartree
nucrepener: 614.41350324 hartree
electener: -1441.57174959 hartree
oneelecener: -2360.90981960 hartree
twoeener: 919.33807001 hartree
kineticenergy: 823.10106859 hartree
exchangeener: -47.059457417945 hartree
correlationener: -3.783304062461 hartree
xcener: -50.842761480407 hartree
energy: -1818.8920 -684.7645 -684.6867 -530.0918 -403.5721 -400.5680 -285.5798 -285.5479 -284.5761 -284.5559 -152.7216 -106.3576 -106.2010 -106.1387 -39.2291 -36.9084 -30.2674 -28.5472 -25.2198 -24.2535 -22.8934 -19.0600 -18.3496 -18.0897 -17.8095 -17.3799 -16.8310 -14.7405 -14.4103 -14.0352 -13.8530 -13.7975 -13.3860 -13.0253 -12.5459 -12.0776 -10.6493 -10.4361 -9.6454 -8.9684 -7.8344 -1.2462 -0.4092 0.9472 1.4138 2.2900 2.7251 3.7106 4.3766 5.1472 5.3793 5.7780 5.9182 6.3653 7.0185 7.3734 9.0437 10.5559 10.9326 11.5034 12.4086 12.6928 13.7618 14.5345 15.1614 15.2427 15.5103 15.6695 16.4590 17.0400 17.3840 17.5787 17.9996 18.2246 19.6985 20.4433 21.0588 21.8845 22.8127 23.9579 24.3459 24.8591 24.9763 25.2738 25.4884 26.5699 27.0214 28.0547 28.4587 29.0226 29.8554 30.5256 30.7235 31.3911 31.5079 31.9441 32.6116 32.8746 33.1214 33.4341 33.5881 34.0722 34.2325 35.6971 36.9999 37.5621 37.9229 38.1450 38.7035 38.8409 39.6348 41.1931 42.7224 42.9147 43.2716 44.8100 45.1134 49.8572 51.2655 51.6116 52.0181 52.4960 53.1796 53.6785 55.3554 55.8551 57.6847 57.8067 58.3737 58.7115 59.4171 60.4259 60.8825 61.8435 62.3464 62.7766 63.1871 64.1395 64.5792 65.3745 65.6950 70.7309 71.1826 72.4248 74.4029 76.3986 76.6193 81.8077 82.6657 83.9180 84.6125 86.8361 363.8213 371.9359 381.2512 389.6006 518.3399 523.5799 694.8266 890.1424 897.8845 electronvolt
chargesum: 0.0000000
charge: -0.262563 0.248287 -0.286730 1.065178 -0.586881 -0.026171 -0.292493 -0.291959 -0.017268 -0.556016 0.268755 0.230383 0.229611 0.277867
charge: -0.154757 0.181542 -0.182111 0.618421 -0.133904 -0.103399 -0.168668 -0.169338 -0.094246 -0.388658 0.149345 0.145042 0.145288 0.155442
qa: -0.2626 0.2483 -0.2867 1.0652 -0.5869 -0.0262 -0.2925 -0.2920 -0.0173 -0.5560 0.2688 0.2304 0.2296 0.2779
va: 1.0756 2.7419 1.0573 4.1880 3.2874 3.6471 3.8650 3.8691 3.6388 2.1892 0.8960 0.9171 0.9171 0.8902
dispersion: -0.007674265 hartree
energy: -827.140437389883 hartree
dipole: -13.50279 12.36741 -1.13538 -2.49185 3.05017 0.55833 2.73219 -2.81176 -0.07957
magnitude: 1.26773 au
magnitude: 3.22232 debye
temp: 298.15 k
press: 1.00 atm
zeropoint: 0.08881908 hartree
thermalvibcorrection: 0.00677854 hartree
thermalrotcorrection: 0.00141627 hartree
thermaltrasncorrection: 0.00141627 hartree
thermaltotal: -827.04200723 hartree
thermalcorr: 0.00961108 hartree
nonthermalcorr: 0.08881908 hartree
totalcorr: 0.09843016 hartree
thermalcorrenthalpy: 0.00094421 hartree
totalenthalpy: -827.04106302 hartree
vibrat: 0.01217804 hartree
rotat: 0.01426059 hartree
transl: 0.01955598 hartree
total: 0.04599462 hartree
totalentropycorr: -0.04599462 hartree
gibbsenthalpy: -827.08705763 hartree
gibbsminuselec: 0.05337976 hartree
