program: Orca
programVersion: 5.0.4
elementType: F Si N C C C C N C C C C H H H H H H H H
charge: 1
multiplicity: 1
keywords: SP DSD-BLYP D3BJ def2-QZVPP def2-QZVPP/C def2/J TightSCF
formula: C8H8FN2Si
InChI: InChI=1/C8H8FN2Si/c9-12(10-5-1-2-6-10)11-7-3-4-8-11/h1-8H
20 atoms
F  0.107325 -2.144898 0.927072
Si 0.030559 -0.710781 0.307666
N  -1.47506 -0.069188 0.052835
C  -2.672096 -0.523083 0.648912
C  -3.673721 0.264083 0.213188
C  -3.124413 1.235602 -0.68796
C  -1.797032 1.027148 -0.775557
N  1.471169 0.030601 -0.035305
C  1.684234 1.398166 -0.310017
C  2.997579 1.571402 -0.551205
C  3.648761 0.298751 -0.433409
C  2.720665 -0.623085 -0.115506
H  -2.679271 -1.359616 1.328182
H  -4.709307 0.169683 0.496035
H  -3.672639 1.995788 -1.220095
H  -1.050879 1.516666 -1.379159
H  0.882004 2.115343 -0.259807
H  3.470889 2.51268 -0.778038
H  4.699939 0.104136 -0.568982
H  2.813026 -1.682147 0.06108
totalener: -806.72107418 hartree
nucrepener: 754.32688213 hartree
electener: -1561.04795631 hartree
oneelecener: -2587.61149912 hartree
twoeener: 1026.56354282 hartree
kineticenergy: 805.06971337 hartree
exchangeener: -27.319810216271 hartree
correlationener: -1.763614971263 hartree
xcener: -29.083425187535 hartree
chargesum: 1.0000000
charge: -0.316618 1.070749 -0.281746 0.031613 -0.090064 -0.071977 0.022446 -0.281691 0.020146 -0.071046 -0.090248 0.037247 0.129503 0.133696 0.129754 0.118637 0.118113 0.130408 0.132005 0.129072
charge: 0.362924 -0.009371 0.373080 0.003073 0.092170 0.092255 -0.010136 0.373346 -0.009965 0.092218 0.092208 0.003056 -0.061056 -0.049454 -0.049232 -0.067636 -0.067866 -0.049298 -0.049507 -0.060809
qa: -0.3166 1.0707 -0.2817 0.0316 -0.0901 -0.0720 0.0224 -0.2817 0.0201 -0.0710 -0.0902 0.0372 0.1295 0.1337 0.1298 0.1186 0.1181 0.1304 0.1320 0.1291
va: 1.1382 4.1728 3.3174 3.7303 3.8423 3.8317 3.7271 3.3186 3.7304 3.8323 3.8427 3.7246 0.9940 0.9890 0.9917 1.0004 1.0004 0.9919 0.9895 0.9943
total: -807.770798067 hartree
dispersion: -0.017012131 hartree
energy: -807.787810198030 hartree
dipole: -0.33221 0.31655 -0.01566 7.06789 -6.93627 0.13162 -3.05366 3.00146 -0.05220
magnitude: 0.14246 au
magnitude: 0.36210 debye
