program: Orca
programVersion: 5.0.4
elementType: O Si N C C C C N C C C C H H H H H H H H
charge: 0
multiplicity: 1
keywords: SP DSD-BLYP D3BJ def2-QZVPP def2-QZVPP/C def2/J TightSCF
formula: C8H8N2OSi
InChI: InChI=1/C8H8N2OSi/c11-12(9-5-1-2-6-9)10-7-3-4-8-10/h1-8H
20 atoms
O  0.130953 -2.553319 -0.140478
Si 0.053776 -1.045623 -0.05425
N  -1.381621 -0.117486 -0.226729
C  -1.703327 1.122758 0.305068
C  -2.986403 1.416298 -0.027931
C  -3.493299 0.324488 -0.790567
C  -2.503024 -0.598901 -0.886649
N  1.389744 -0.00202 0.222392
C  1.553086 1.333892 -0.116385
C  2.808075 1.717225 0.230588
C  3.461046 0.586352 0.801887
C  2.581915 -0.447268 0.774948
H  -0.999291 1.677012 0.902645
H  -3.518985 2.31056 0.251539
H  -4.48043 0.236298 -1.213515
H  -2.486935 -1.564295 -1.365156
H  0.768705 1.890186 -0.601352
H  3.227661 2.699178 0.08454
H  4.468558 0.547345 1.181865
H  2.690266 -1.470703 1.094102
totalener: -782.34395423 hartree
nucrepener: 742.32677661 hartree
electener: -1524.67073084 hartree
oneelecener: -2544.08121171 hartree
twoeener: 1019.41048087 hartree
kineticenergy: 780.73899245 hartree
exchangeener: -26.825256189260 hartree
correlationener: -1.753661126696 hartree
xcener: -28.578917315956 hartree
chargesum: 0.0000000
charge: -0.622614 0.877003 -0.332801 0.005928 -0.122636 -0.131595 0.020760 -0.337288 0.009527 -0.121234 -0.135050 0.019670 0.114041 0.092597 0.092673 0.133194 0.115306 0.090837 0.094044 0.137639
charge: 0.049689 -0.241860 0.380292 -0.051928 0.039284 0.041184 -0.030399 0.380081 -0.050930 0.039328 0.041285 -0.030395 -0.075466 -0.071705 -0.072129 -0.063607 -0.075465 -0.071659 -0.072173 -0.063426
qa: -0.6226 0.8770 -0.3328 0.0059 -0.1226 -0.1316 0.0208 -0.3373 0.0095 -0.1212 -0.1351 0.0197 0.1140 0.0926 0.0927 0.1332 0.1153 0.0908 0.0940 0.1376
va: 2.0968 4.4789 3.2240 3.7518 3.8344 3.8171 3.7645 3.2244 3.7496 3.8325 3.8180 3.7569 0.9990 1.0029 1.0036 1.0004 0.9984 1.0030 1.0030 0.9989
total: -783.402369657 hartree
dispersion: -0.017551978 hartree
energy: -783.419921634511 hartree
dipole: -0.31110 0.23445 -0.07664 5.95554 -4.42961 1.52593 0.31496 -0.22763 0.08733
magnitude: 1.53035 au
magnitude: 3.88983 debye
