program: Orca
programVersion: 5.0.4
elementType: F N Si F F N C C C C C F H H H H H H
charge: 0
multiplicity: 1
keywords: Opt RIJCOSX PBEh-3c
formula: C5H6F4N2Si
InChI: InChI=1/C5H6F4N2Si/c6-11(7)12(8,9)10-4-2-1-3-5-10/h2-5H,1H2
18 atoms
F  2.478373 1.296164 -1.379779
N  2.905815 0.839076 -0.142794
Si 2.000544 -0.696507 0.098157
F  2.334455 -1.739594 -1.055825
F  2.515888 -1.213984 1.511631
N  0.329126 -0.383851 0.124347
C  -0.440644 -0.41928 -1.052484
C  -1.721125 -0.073656 -1.095988
C  -2.494603 0.392265 0.09927
C  -1.610485 0.404864 1.308773
C  -0.33183 0.049213 1.286715
F  4.235339 0.526167 -0.342111
H  0.071812 -0.756897 -1.942463
H  -2.228082 -0.139529 -2.049139
H  -3.363385 -0.255061 0.26772
H  -2.914431 1.389243 -0.079591
H  -2.031819 0.714024 2.255672
H  0.265154 0.067343 2.18819
totalener: -990.76450425 hartree
nucrepener: 877.13384419 hartree
electener: -1867.89834843 hartree
oneelecener: -3112.99069121 hartree
twoeener: 1245.09234278 hartree
kineticenergy: 985.49209212 hartree
exchangeener: -57.058513223168 hartree
correlationener: -4.616818796378 hartree
xcener: -61.675332019545 hartree
dispersion: -0.010371168 hartree
dispersion: -0.010364227 hartree
dispersion: -0.010366359 hartree
dispersion: -0.010367733 hartree
dispersion: -0.010370598 hartree
dispersion: -0.010373095 hartree
dispersion: -0.010373402 hartree
dispersion: -0.010373276 hartree
dispersion: -0.010373159 hartree
energy: -1820.2030 -684.2044 -684.1608 -683.8582 -683.8323 -402.9089 -399.7382 -285.5809 -285.5572 -284.5307 -284.4030 -284.3872 -153.6698 -107.2708 -107.2243 -107.1624 -38.6509 -36.9284 -36.4750 -36.3427 -29.1756 -24.7779 -24.4531 -23.6844 -20.6625 -19.3946 -18.7708 -17.6135 -17.2861 -16.8746 -16.5354 -16.0466 -15.4608 -15.0532 -14.9665 -14.8637 -14.4737 -14.3236 -14.1262 -13.8212 -13.7410 -13.5222 -13.3538 -13.0304 -12.2920 -11.6989 -10.9864 -9.3583 -8.9803 -6.8794 0.5018 1.3569 1.4715 1.9043 2.3146 3.5945 4.1004 4.3796 4.6490 4.8927 5.3243 5.9752 6.1561 6.2189 6.7523 7.5351 7.6887 8.4919 9.5459 10.9277 11.4431 11.5366 11.8435 12.6959 13.8640 13.9105 14.4459 14.9098 15.1870 15.8855 16.1864 16.6577 17.1412 17.5440 17.8328 18.2242 18.8919 19.6153 20.2351 20.5533 21.0225 22.3893 22.7289 23.3725 23.9021 25.2355 25.7695 25.8747 26.2145 26.7262 27.0875 27.3194 27.5030 28.1177 28.4555 29.2512 30.1345 30.6978 31.3850 31.4797 32.0020 32.2382 32.8724 32.9432 33.0324 33.1875 33.3669 33.5034 33.7718 33.8605 33.9962 34.1330 34.5586 34.6437 34.8593 35.1770 35.4304 36.3260 36.6860 36.9043 37.0631 37.5967 38.0487 38.7105 39.4327 40.4169 41.3300 42.2568 42.4058 43.3816 44.1531 45.0782 46.1559 46.3361 47.2926 48.4259 48.9149 49.2534 49.7763 50.9359 51.9968 52.6130 53.5087 53.6197 55.1391 56.1095 58.7455 58.9939 59.0956 59.5160 60.5349 60.8643 61.0634 61.1316 62.5466 63.4987 64.1138 65.8972 66.2892 66.9028 67.0881 71.4466 72.1039 73.0891 74.0148 74.1561 75.8795 76.8455 80.2572 80.5774 82.9744 83.5458 87.3576 90.7065 365.1157 368.5983 378.6632 386.0633 387.1928 519.5365 526.1854 889.1192 891.3399 893.6668 898.9924 electronvolt
chargesum: -0.0000000
charge: -0.289247 0.262824 1.400508 -0.435144 -0.434487 -0.650806 0.027915 -0.309870 -0.435589 -0.310008 0.028033 -0.287005 0.256673 0.227834 0.232416 0.233619 0.227881 0.254453
charge: -0.182598 0.190733 0.653544 -0.206326 -0.205366 -0.191114 -0.069827 -0.175987 -0.230016 -0.176016 -0.070252 -0.178168 0.146151 0.141739 0.133244 0.133746 0.141697 0.144817
qa: -0.2892 0.2628 1.4005 -0.4351 -0.4345 -0.6508 0.0279 -0.3099 -0.4356 -0.3100 0.0280 -0.2870 0.2567 0.2278 0.2324 0.2336 0.2279 0.2545
va: 1.0602 2.7321 4.0292 1.0111 1.0094 3.1352 3.7161 3.8220 3.7112 3.8220 3.7140 1.0574 0.8949 0.9192 0.8904 0.8901 0.9192 0.8951
dispersion: -0.010372863 hartree
energy: -990.736051255213 hartree
dipole: -22.57457 21.59864 -0.97592 2.32491 -2.44623 -0.12132 1.90405 -1.77384 0.13021
magnitude: 0.99202 au
magnitude: 2.52151 debye
