program: Orca
programVersion: 5.0.4
elementType: F N F Si N C C C C C O H H H H H H
charge: 0
multiplicity: 1
keywords: Freq RIJCOSX PBEh-3c
frequency: 0.00 0.00 0.00 0.00 0.00 0.00 42.70 65.93 74.33 116.64 151.62 195.56 213.90 274.00 335.91 359.11 441.54 469.84 520.25 546.92 648.68 656.57 731.03 780.05 789.97 933.28 1001.34 1015.70 1019.19 1021.57 1026.29 1042.63 1140.39 1170.21 1185.96 1261.65 1291.10 1340.70 1363.41 1411.09 1468.06 1502.67 1539.79 1776.29 1836.88 3072.14 3102.51 3276.12 3277.97 3295.86 3308.53
frequency: 42.70 65.93 74.33 116.64 151.62 195.56 213.90 274.00 335.91 359.11 441.54 469.84 520.25 546.92 648.68 656.57 731.03 780.05 789.97 933.28 1001.34 1015.70 1019.19 1021.57 1026.29 1042.63 1140.39 1170.21 1185.96 1261.65 1291.10 1340.70 1363.41 1411.09 1468.06 1502.67 1539.79 1776.29 1836.88 3072.14 3102.51 3276.12 3277.97 3295.86 3308.53
formula: C5H6F2N2OSi
InChI: InChI=1/C5H6F2N2OSi/c6-9(7)11(10)8-4-2-1-3-5-8/h2-5H,1H2
17 atoms
F  4.19395 -1.115697 -0.319832
N  2.920196 -0.844757 -0.739446
F  3.081234 0.122874 -1.731417
Si 2.1106 0.082516 0.588117
N  0.459566 -0.020784 0.22183
C  -0.091124 -0.67763 -0.897096
C  -1.37225 -0.583644 -1.228911
C  -2.366335 0.238033 -0.470758
C  -1.74321 0.774849 0.779224
C  -0.453413 0.65257 1.06391
O  2.769123 0.751414 1.773198
H  0.591914 -1.289887 -1.466872
H  -1.708735 -1.136885 -2.095326
H  -2.742501 1.058699 -1.094067
H  -3.250213 -0.362434 -0.229728
H  -2.370653 1.293197 1.491638
H  -0.028249 1.057568 1.971936
totalener: -866.37266705 hartree
nucrepener: 711.16468328 hartree
electener: -1577.53735033 hartree
oneelecener: -2606.44225448 hartree
twoeener: 1028.90490415 hartree
kineticenergy: 861.96330404 hartree
exchangeener: -50.343409348112 hartree
correlationener: -4.124449849440 hartree
xcener: -54.467859197552 hartree
energy: -1818.4596 -684.5165 -684.4727 -529.7318 -403.3321 -400.2681 -285.7799 -285.7328 -284.7802 -284.7079 -284.6832 -152.3008 -105.9312 -105.7856 -105.7196 -38.9836 -36.6712 -29.5185 -28.1697 -25.0564 -24.7078 -23.9123 -20.8626 -19.6395 -18.4723 -17.8682 -17.2088 -16.6213 -15.7469 -15.1994 -14.5183 -14.2888 -14.0947 -14.0363 -13.6960 -13.2739 -12.7695 -12.1728 -11.6485 -11.2582 -10.2363 -10.1399 -9.3821 -9.2113 -7.2390 -0.7695 -0.1512 0.3301 1.6383 1.9653 2.9148 3.7606 4.1298 4.5437 4.8145 5.5103 5.8317 6.0202 6.0776 6.3081 7.2621 7.5338 8.3936 9.0143 10.7476 11.1374 11.9943 12.6845 12.8695 13.6166 13.7918 14.4415 14.6011 15.2979 15.4348 15.6363 16.1542 16.4791 17.2498 17.5817 17.8652 18.6931 19.0665 19.8374 20.0624 21.2352 21.6270 22.7139 24.6901 25.0600 25.2840 25.4480 25.8534 26.1170 26.4206 26.5042 27.1032 27.7182 28.0286 28.1242 29.0133 30.0577 30.6765 30.8246 31.2016 31.6774 32.1342 32.4231 32.7715 33.0281 33.2933 33.5532 33.7387 33.9065 34.3365 35.0895 35.1400 36.2880 37.3397 38.4492 39.1540 39.6258 40.6320 41.1109 41.7904 42.1248 43.8319 44.3649 45.4622 45.9210 48.5859 49.0049 50.9286 51.7143 51.9309 52.3021 52.7890 53.4185 53.8923 54.8743 56.0651 57.7025 58.0958 58.2642 58.6802 58.8586 59.3398 59.7744 60.3023 60.7969 61.7658 61.9160 62.7170 65.1038 65.5627 66.0714 66.3361 67.0152 71.2183 71.9541 72.6588 73.0056 73.5111 75.5748 75.7926 77.9113 82.7094 83.6213 87.8023 90.2984 364.6553 368.3881 378.4078 385.8761 387.0462 518.7182 525.6447 695.2318 890.5764 898.5926 electronvolt
chargesum: -0.0000000
charge: -0.266675 0.238094 -0.287635 1.038826 -0.654096 0.015254 -0.299698 -0.441466 -0.302512 0.026891 -0.571823 0.273350 0.234824 0.242323 0.237057 0.235802 0.281485
charge: -0.158175 0.176247 -0.184837 0.585011 -0.178870 -0.077895 -0.165477 -0.231513 -0.165069 -0.070363 -0.404050 0.150142 0.144735 0.139010 0.137721 0.145331 0.158053
qa: -0.2667 0.2381 -0.2876 1.0388 -0.6541 0.0153 -0.2997 -0.4415 -0.3025 0.0269 -0.5718 0.2733 0.2348 0.2423 0.2371 0.2358 0.2815
va: 1.0717 2.7251 1.0544 4.2274 3.1685 3.6787 3.8111 3.7038 3.8120 3.6622 2.1725 0.8920 0.9169 0.8862 0.8908 0.9165 0.8870
dispersion: -0.009900800 hartree
energy: -866.351140658568 hartree
dipole: -20.12502 18.49954 -1.62548 1.74076 -2.07967 -0.33891 0.80713 -1.46255 -0.65542
magnitude: 1.78511 au
magnitude: 4.53740 debye
temp: 298.15 k
press: 1.00 atm
zeropoint: 0.11868314 hartree
thermalvibcorrection: 0.00789970 hartree
thermalrotcorrection: 0.00141627 hartree
thermaltrasncorrection: 0.00141627 hartree
thermaltotal: -866.22172528 hartree
thermalcorr: 0.01073224 hartree
nonthermalcorr: 0.11868314 hartree
totalcorr: 0.12941538 hartree
thermalcorrenthalpy: 0.00094421 hartree
totalenthalpy: -866.22078107 hartree
vibrat: 0.01396539 hartree
rotat: 0.01457659 hartree
transl: 0.01967347 hartree
total: 0.04821545 hartree
totalentropycorr: -0.04821545 hartree
gibbsenthalpy: -866.26899652 hartree
gibbsminuselec: 0.08214414 hartree
