program: Orca
programVersion: 5.0.4
elementType: F Si N C C C C C F N C C C C C H H H H H H H H H H H H
charge: 0
multiplicity: 1
keywords: Freq RIJCOSX PBEh-3c
frequency: 0.00 0.00 0.00 0.00 0.00 0.00 29.64 37.41 54.42 62.85 112.77 136.01 155.26 191.88 246.80 271.42 279.83 289.57 362.59 435.12 438.28 447.04 503.38 549.24 550.03 653.24 653.94 659.78 736.46 771.12 772.03 782.08 783.99 912.61 932.51 936.03 982.33 1006.45 1007.65 1012.80 1014.78 1020.91 1022.24 1025.04 1033.70 1042.11 1042.28 1174.74 1178.35 1190.90 1197.60 1260.90 1261.33 1293.73 1296.08 1362.64 1369.40 1411.55 1411.88 1469.41 1469.76 1508.61 1508.79 1549.73 1549.79 1773.18 1773.59 1835.31 1836.13 3065.47 3066.09 3083.94 3085.14 3264.10 3268.55 3272.40 3273.18 3284.32 3287.44 3296.76 3301.06
frequency: 29.64 37.41 54.42 62.85 112.77 136.01 155.26 191.88 246.80 271.42 279.83 289.57 362.59 435.12 438.28 447.04 503.38 549.24 550.03 653.24 653.94 659.78 736.46 771.12 772.03 782.08 783.99 912.61 932.51 936.03 982.33 1006.45 1007.65 1012.80 1014.78 1020.91 1022.24 1025.04 1033.70 1042.11 1042.28 1174.74 1178.35 1190.90 1197.60 1260.90 1261.33 1293.73 1296.08 1362.64 1369.40 1411.55 1411.88 1469.41 1469.76 1508.61 1508.79 1549.73 1549.79 1773.18 1773.59 1835.31 1836.13 3065.47 3066.09 3083.94 3085.14 3264.10 3268.55 3272.40 3273.18 3284.32 3287.44 3296.76 3301.06
formula: C10H12F2N2Si
InChI: InChI=1/C10H12F2N2Si/c11-15(12,13-7-3-1-4-8-13)14-9-5-2-6-10-14/h3-10H,1-2H2
27 atoms
F  0.076673 -2.44137 -1.539624
Si 0.031033 -1.645371 -0.149603
N  1.41109 -0.673809 0.151402
C  1.640518 0.468757 -0.63093
C  2.727164 1.225773 -0.528256
C  3.842665 0.940444 0.43092
C  3.510605 -0.26798 1.253241
C  2.402139 -0.983524 1.094759
F  -0.005236 -2.765421 0.995388
N  -1.371919 -0.66097 -0.221929
C  -1.517277 0.465004 0.602621
C  -2.631133 1.185975 0.674569
C  -3.871271 0.872398 -0.106653
C  -3.642709 -0.340075 -0.956892
C  -2.496442 -1.011248 -0.985022
H  0.85742 0.715642 -1.336343
H  2.802735 2.091321 -1.17265
H  4.786026 0.791553 -0.10865
H  4.021881 1.807832 1.077648
H  4.207349 -0.580114 2.019608
H  2.208176 -1.848292 1.712795
H  -0.645877 0.731881 1.185734
H  -2.634993 2.045328 1.331703
H  -4.721616 0.715345 0.568173
H  -4.159715 1.728229 -0.729103
H  -4.447644 -0.690255 -1.58904
H  -2.379643 -1.877054 -1.621268
totalener: -985.30614412 hartree
nucrepener: 1133.87100744 hartree
electener: -2119.17715156 hartree
oneelecener: -3605.66571792 hartree
twoeener: 1486.48856636 hartree
kineticenergy: 979.39167659 hartree
exchangeener: -61.469436645214 hartree
correlationener: -5.319020816513 hartree
xcener: -66.788457461727 hartree
energy: -1819.5623 -683.1296 -683.1086 -399.3292 -399.2806 -285.3032 -285.2633 -285.2327 -285.2235 -284.3156 -284.2742 -284.1533 -284.1121 -284.0890 -284.0836 -152.9686 -106.5585 -106.5244 -106.4913 -36.2424 -35.7080 -28.9697 -28.6140 -24.3796 -24.1993 -23.4059 -23.3275 -20.5034 -20.1629 -19.1384 -18.9991 -18.0975 -16.6926 -16.4095 -15.6256 -15.2211 -15.0767 -14.6775 -14.5897 -14.3978 -14.3287 -13.9422 -13.6910 -13.6130 -13.4104 -13.3820 -13.3681 -13.2978 -12.7684 -12.0514 -11.8599 -11.4763 -11.2942 -10.7202 -10.6668 -8.7587 -8.6309 -6.5868 -6.5373 0.6199 0.9591 2.2613 2.2815 2.4315 3.5540 3.7090 4.0614 4.5829 4.7013 5.0223 5.0896 5.1554 5.2168 6.0783 6.2296 6.2976 6.3486 6.3543 6.4175 6.5951 7.0477 7.8412 7.8980 8.0779 8.6112 8.8751 9.5509 9.8346 11.0478 11.2531 11.5421 11.8918 13.1641 13.2256 13.5799 13.9167 14.5596 14.6130 15.0231 15.3040 15.4078 15.6315 15.8999 16.0573 16.3029 16.3233 16.5445 16.8535 17.2274 17.4007 17.6190 17.8958 18.0495 18.2040 18.8745 19.1468 19.5092 20.5679 20.6414 21.5042 21.5530 22.1582 22.4582 23.3528 23.6052 24.6104 25.1556 25.5999 25.8362 26.0015 26.2725 26.3783 26.5264 26.6595 26.9236 27.0404 27.2208 27.5487 27.6946 28.2675 28.3229 28.4190 28.6435 28.9813 30.1547 30.4025 31.1951 31.3886 32.2835 32.3701 32.5349 33.6013 33.8750 34.1239 34.5680 34.7426 34.9786 35.5024 35.6643 35.9327 36.3426 36.7774 37.1016 37.7187 38.1440 38.5654 38.9999 39.4918 39.9271 40.4388 40.9613 41.2495 41.5508 41.8440 41.9540 42.5813 42.6456 43.4280 44.3910 45.9394 46.3147 47.5120 48.7276 48.9784 49.3114 49.3747 49.5002 49.6773 50.4564 51.0626 52.4304 52.9536 53.2869 53.4258 55.4094 55.4633 56.0632 57.0647 58.4830 59.0006 59.0888 59.2981 59.4290 59.9974 60.4612 60.8703 61.1840 61.4797 61.6524 61.7335 63.3327 63.9572 66.0954 66.1878 67.0034 67.2332 67.2786 67.3884 71.6905 71.7752 72.1990 72.5295 73.2365 73.3819 74.1490 74.2783 74.3792 74.6421 76.0245 76.2868 76.9768 77.5333 80.7064 81.4227 83.6867 83.8884 90.8032 91.1466 365.4083 365.5386 368.9795 369.0193 378.9054 378.9954 386.1247 386.7024 387.2882 387.7656 526.5881 527.2189 892.2383 893.7510 electronvolt
chargesum: -0.0000000
charge: -0.438719 1.390917 -0.659900 0.025728 -0.312998 -0.433621 -0.315708 0.025592 -0.440056 -0.656826 0.023927 -0.316076 -0.433155 -0.313625 0.028739 0.258081 0.222811 0.229409 0.226016 0.222168 0.256469 0.260485 0.221610 0.227696 0.226048 0.221428 0.253559
charge: -0.225431 0.669663 -0.195752 -0.073579 -0.181572 -0.230372 -0.186294 -0.070055 -0.224718 -0.194394 -0.072988 -0.184499 -0.230374 -0.184598 -0.069973 0.145367 0.139201 0.130633 0.129601 0.138678 0.145199 0.145798 0.138500 0.129984 0.129333 0.138401 0.144243
qa: -0.4387 1.3909 -0.6599 0.0257 -0.3130 -0.4336 -0.3157 0.0256 -0.4401 -0.6568 0.0239 -0.3161 -0.4332 -0.3136 0.0287 0.2581 0.2228 0.2294 0.2260 0.2222 0.2565 0.2605 0.2216 0.2277 0.2260 0.2214 0.2536
va: 1.0008 4.0206 3.1216 3.7149 3.8248 3.7165 3.8118 3.7192 1.0003 3.1232 3.7175 3.8229 3.7171 3.8160 3.7181 0.8940 0.9211 0.8909 0.8926 0.9213 0.8974 0.8922 0.9216 0.8919 0.8922 0.9214 0.8983
dispersion: -0.017950253 hartree
energy: -985.275236711108 hartree
dipole: -0.25979 0.27866 0.01887 15.46505 -14.83220 0.63285 1.93325 -1.83787 0.09539
magnitude: 0.64028 au
magnitude: 1.62746 debye
temp: 298.15 k
press: 1.00 atm
zeropoint: 0.21685759 hartree
thermalvibcorrection: 0.01109806 hartree
thermalrotcorrection: 0.00141627 hartree
thermaltrasncorrection: 0.00141627 hartree
thermaltotal: -985.04444852 hartree
thermalcorr: 0.01393060 hartree
nonthermalcorr: 0.21685759 hartree
totalcorr: 0.23078819 hartree
thermalcorrenthalpy: 0.00094421 hartree
totalenthalpy: -985.04350432 hartree
vibrat: 0.01963523 hartree
rotat: 0.01538781 hartree
transl: 0.02002791 hartree
total: 0.05505096 hartree
totalentropycorr: -0.05505096 hartree
gibbsenthalpy: -985.09855527 hartree
gibbsminuselec: 0.17668144 hartree
