program: Orca
programVersion: 5.0.4
elementType: F Si N C C C C C F N C C C C C H H H H H H H H H H H H
charge: 0
multiplicity: 1
keywords: Opt RIJCOSX PBEh-3c
formula: C10H12F2N2Si
InChI: InChI=1/C10H12F2N2Si/c11-15(12,13-7-3-1-4-8-13)14-9-5-2-6-10-14/h3-10H,1-2H2
27 atoms
F  0.076673 -2.44137 -1.539624
Si 0.031033 -1.645371 -0.149603
N  1.41109 -0.673809 0.151402
C  1.640518 0.468757 -0.63093
C  2.727164 1.225773 -0.528256
C  3.842665 0.940444 0.430921
C  3.510605 -0.26798 1.253241
C  2.402139 -0.983524 1.094759
F  -0.005236 -2.765421 0.995388
N  -1.371919 -0.66097 -0.221929
C  -1.517277 0.465004 0.602621
C  -2.631133 1.185975 0.674569
C  -3.871271 0.872398 -0.106653
C  -3.642709 -0.340074 -0.956892
C  -2.496442 -1.011248 -0.985022
H  0.85742 0.715642 -1.336343
H  2.802735 2.091321 -1.17265
H  4.786026 0.791553 -0.10865
H  4.021881 1.807832 1.077648
H  4.207349 -0.580114 2.019608
H  2.208176 -1.848292 1.712795
H  -0.645877 0.731881 1.185734
H  -2.634993 2.045328 1.331703
H  -4.721616 0.715345 0.568173
H  -4.159715 1.728229 -0.729103
H  -4.447644 -0.690255 -1.58904
H  -2.379643 -1.877054 -1.621268
totalener: -985.30618326 hartree
nucrepener: 1133.87846458 hartree
electener: -2119.18464784 hartree
oneelecener: -3605.68692886 hartree
twoeener: 1486.50228101 hartree
kineticenergy: 979.39079797 hartree
exchangeener: -61.469375988714 hartree
correlationener: -5.319036504312 hartree
xcener: -66.788412493026 hartree
dispersion: -0.017945724 hartree
dispersion: -0.017943221 hartree
dispersion: -0.017940801 hartree
dispersion: -0.017941194 hartree
dispersion: -0.017947139 hartree
energy: -1819.5610 -683.1323 -683.1103 -399.3290 -399.2802 -285.3009 -285.2618 -285.2304 -285.2218 -284.3173 -284.2761 -284.1549 -284.1137 -284.0909 -284.0855 -152.9673 -106.5572 -106.5232 -106.4901 -36.2428 -35.7084 -28.9689 -28.6133 -24.3801 -24.1999 -23.4056 -23.3272 -20.5035 -20.1631 -19.1382 -18.9989 -18.0972 -16.6922 -16.4095 -15.6259 -15.2210 -15.0766 -14.6777 -14.5899 -14.3981 -14.3290 -13.9425 -13.6910 -13.6130 -13.4106 -13.3824 -13.3682 -13.2980 -12.7687 -12.0512 -11.8596 -11.4766 -11.2943 -10.7206 -10.6673 -8.7585 -8.6307 -6.5868 -6.5372 0.6200 0.9592 2.2616 2.2818 2.4319 3.5545 3.7095 4.0614 4.5833 4.7013 5.0223 5.0896 5.1555 5.2169 6.0783 6.2295 6.2973 6.3481 6.3539 6.4172 6.5948 7.0476 7.8415 7.8982 8.0785 8.6113 8.8750 9.5511 9.8348 11.0482 11.2531 11.5419 11.8923 13.1644 13.2260 13.5804 13.9169 14.5597 14.6132 15.0232 15.3041 15.4081 15.6315 15.8998 16.0572 16.3032 16.3233 16.5441 16.8533 17.2273 17.4004 17.6188 17.8958 18.0496 18.2041 18.8744 19.1463 19.5093 20.5677 20.6411 21.5046 21.5533 22.1587 22.4588 23.3533 23.6055 24.6108 25.1558 25.5997 25.8361 26.0017 26.2727 26.3780 26.5263 26.6599 26.9230 27.0398 27.2214 27.5488 27.6946 28.2673 28.3226 28.4185 28.6433 28.9816 30.1549 30.4026 31.1952 31.3886 32.2835 32.3701 32.5349 33.6013 33.8749 34.1239 34.5678 34.7425 34.9786 35.5025 35.6646 35.9327 36.3428 36.7775 37.1016 37.7187 38.1442 38.5654 39.0000 39.4915 39.9273 40.4391 40.9618 41.2497 41.5509 41.8439 41.9539 42.5815 42.6457 43.4283 44.3913 45.9398 46.3151 47.5121 48.7278 48.9784 49.3110 49.3745 49.4998 49.6771 50.4562 51.0628 52.4303 52.9537 53.2868 53.4254 55.4094 55.4633 56.0634 57.0647 58.4833 59.0008 59.0890 59.2978 59.4287 59.9976 60.4611 60.8704 61.1840 61.4798 61.6526 61.7336 63.3331 63.9574 66.0953 66.1877 67.0030 67.2327 67.2781 67.3881 71.6903 71.7749 72.1989 72.5295 73.2368 73.3822 74.1494 74.2788 74.3796 74.6423 76.0245 76.2868 76.9770 77.5334 80.7063 81.4226 83.6869 83.8886 90.8033 91.1468 365.4081 365.5383 368.9795 369.0193 378.9048 378.9949 386.1248 386.7025 387.2876 387.7651 526.5885 527.2193 892.2365 893.7493 electronvolt
chargesum: -0.0000000
charge: -0.438671 1.390764 -0.659831 0.025513 -0.312887 -0.433570 -0.315625 0.025436 -0.440021 -0.656766 0.023709 -0.315957 -0.433102 -0.313520 0.028557 0.258132 0.222820 0.229404 0.226007 0.222177 0.256506 0.260541 0.221619 0.227691 0.226039 0.221436 0.253599
charge: -0.225397 0.669530 -0.195712 -0.073710 -0.181495 -0.230327 -0.186232 -0.070152 -0.224687 -0.194359 -0.073124 -0.184416 -0.230327 -0.184516 -0.070089 0.145392 0.139205 0.130625 0.129593 0.138682 0.145218 0.145824 0.138503 0.129978 0.129325 0.138405 0.144262
qa: -0.4387 1.3908 -0.6598 0.0255 -0.3129 -0.4336 -0.3156 0.0254 -0.4400 -0.6568 0.0237 -0.3160 -0.4331 -0.3135 0.0286 0.2581 0.2228 0.2294 0.2260 0.2222 0.2565 0.2605 0.2216 0.2277 0.2260 0.2214 0.2536
va: 1.0009 4.0208 3.1217 3.7149 3.8249 3.7166 3.8118 3.7192 1.0003 3.1232 3.7175 3.8229 3.7172 3.8161 3.7181 0.8940 0.9211 0.8909 0.8926 0.9213 0.8974 0.8922 0.9216 0.8919 0.8922 0.9214 0.8983
dispersion: -0.017950253 hartree
energy: -985.275236762641 hartree
dipole: -0.25979 0.27854 0.01875 15.46505 -14.83168 0.63336 1.93325 -1.83785 0.09540
magnitude: 0.64078 au
magnitude: 1.62874 debye
