program: Orca
programVersion: 5.0.4
elementType: O Si N C C C C C N C C C C C H H H H H H H H H H H H
charge: 0
multiplicity: 1
keywords: Freq RIJCOSX PBEh-3c
frequency: 0.00 0.00 0.00 0.00 0.00 0.00 44.28 52.01 57.79 79.68 157.41 157.84 186.17 212.36 273.50 287.46 355.72 414.10 440.98 457.02 491.80 548.18 556.76 651.60 653.12 663.36 735.24 773.95 778.88 785.96 791.24 931.89 932.59 999.85 1011.87 1012.77 1020.67 1022.17 1023.15 1025.35 1028.53 1042.49 1045.99 1145.95 1169.05 1175.42 1195.24 1260.66 1260.95 1289.01 1289.38 1327.03 1355.10 1369.79 1408.12 1408.44 1463.72 1466.81 1500.72 1502.52 1545.30 1545.45 1771.70 1772.49 1833.02 1834.00 3065.13 3065.31 3097.46 3097.55 3270.94 3272.54 3274.35 3275.06 3290.71 3293.51 3294.19 3295.33
frequency: 44.28 52.01 57.79 79.68 157.41 157.84 186.17 212.36 273.50 287.46 355.72 414.10 440.98 457.02 491.80 548.18 556.76 651.60 653.12 663.36 735.24 773.95 778.88 785.96 791.24 931.89 932.59 999.85 1011.87 1012.77 1020.67 1022.17 1023.15 1025.35 1028.53 1042.49 1045.99 1145.95 1169.05 1175.42 1195.24 1260.66 1260.95 1289.01 1289.38 1327.03 1355.10 1369.79 1408.12 1408.44 1463.72 1466.81 1500.72 1502.52 1545.30 1545.45 1771.70 1772.49 1833.02 1834.00 3065.13 3065.31 3097.46 3097.55 3270.94 3272.54 3274.35 3275.06 3290.71 3293.51 3294.19 3295.33
formula: C10H12N2OSi
InChI: InChI=1/C10H12N2OSi/c13-14(11-7-3-1-4-8-11)12-9-5-2-6-10-12/h3-10H,1-2H2
26 atoms
O  0.182203 -2.932518 -1.267485
Si 0.099188 -1.542521 -0.664248
N  -1.359652 -0.738024 -0.277589
C  -1.529996 0.654845 -0.223436
C  -2.678471 1.235468 0.105843
C  -3.912692 0.46954 0.471183
C  -3.706445 -0.98858 0.196091
C  -2.530721 -1.508047 -0.135989
N  1.446256 -0.562531 -0.275108
C  1.482968 0.391561 0.754309
C  2.543423 1.150665 1.00634
C  3.809869 1.086317 0.208741
C  3.756008 -0.071769 -0.740294
C  2.664581 -0.800741 -0.939866
H  -0.670324 1.246796 -0.504822
H  -2.721622 2.316231 0.08826
H  -4.174129 0.633269 1.524414
H  -4.771706 0.846085 -0.094997
H  -4.554417 -1.656413 0.265055
H  -2.409489 -2.564148 -0.334592
H  0.595549 0.455143 1.368716
H  2.487502 1.835376 1.841953
H  3.97464 2.02617 -0.333396
H  4.672726 0.990194 0.8769
H  4.649346 -0.335871 -1.28982
H  2.655402 -1.636595 -1.626164
totalener: -860.91768966 hartree
nucrepener: 953.49768481 hartree
electener: -1814.41537446 hartree
oneelecener: -3070.17299482 hartree
twoeener: 1255.75762036 hartree
kineticenergy: 855.87810715 hartree
exchangeener: -54.760120432354 hartree
correlationener: -4.827086856088 hartree
xcener: -59.587207288443 hartree
energy: -1817.7667 -528.9715 -399.6722 -399.6652 -285.5021 -285.4876 -285.3477 -285.3296 -284.4816 -284.4757 -284.3887 -284.3825 -284.2680 -284.2631 -151.5568 -105.1858 -105.0519 -104.9916 -29.2540 -28.8169 -27.4298 -24.5526 -24.4041 -23.6144 -23.4987 -20.6167 -20.3187 -19.3611 -19.1195 -17.6916 -16.6493 -15.6665 -15.0822 -14.8695 -14.7742 -14.0545 -13.8522 -13.7429 -13.6305 -13.5893 -13.2929 -12.4383 -12.2392 -11.8440 -11.4404 -11.0048 -10.8758 -10.8118 -9.5468 -9.2025 -8.9159 -8.7840 -6.9414 -6.6721 0.2568 0.4096 0.7985 0.8108 2.2012 2.6136 3.7975 3.9740 4.2680 4.6925 4.8196 5.0498 5.1343 5.2512 5.7868 5.9125 6.0450 6.1982 6.4170 6.5107 6.5664 6.8470 7.7659 7.7845 7.9752 8.4832 8.7860 9.0720 9.7855 11.2152 11.3013 11.6377 11.7544 13.1669 13.3317 13.7351 13.8837 14.2506 14.4912 14.7055 15.0292 15.3416 15.6314 15.8288 16.1242 16.2030 16.3560 16.4047 16.5332 17.1142 17.3018 17.3666 17.5966 18.0839 18.3070 18.9699 19.0017 19.2612 19.7377 20.1971 20.5016 21.1465 22.6442 22.6902 23.3436 24.2192 25.2862 25.3905 25.4758 25.8030 26.1629 26.1885 26.4771 26.5135 26.7255 26.7660 26.8698 27.0736 27.2367 27.8601 27.9891 28.2167 28.3261 28.3943 28.9661 29.9635 30.1208 31.1561 31.2403 31.6256 31.9517 32.6837 33.1302 33.7858 34.7198 34.8979 35.4003 36.0777 38.2920 38.4706 38.8323 39.6579 40.0695 40.6906 41.4850 41.8413 42.4332 42.4575 42.6629 43.1394 44.6132 45.6661 46.3679 46.4030 48.7930 48.9714 49.3899 49.6851 51.8346 52.0361 52.3516 52.5598 53.3646 53.5748 54.2846 55.1913 55.2091 56.0507 56.2139 58.1180 58.4368 58.5512 58.8869 59.1604 59.1881 59.3884 59.7416 60.0144 60.2525 60.4461 61.8620 62.1364 62.7442 63.0970 64.3826 65.7659 65.9001 66.7182 66.7411 67.2711 67.4183 71.4343 71.6216 71.6527 72.6120 72.6814 72.8657 73.1434 73.8040 73.8790 74.8641 75.8642 76.3177 76.3710 77.0667 78.6360 82.8585 83.9116 90.3655 90.8699 365.0284 365.1317 368.6773 369.0035 378.6685 378.7770 385.8491 386.6280 386.9723 387.5548 526.1875 526.5398 696.3175 electronvolt
chargesum: 0.0000000
charge: -0.606499 1.050639 -0.657684 0.002366 -0.307254 -0.437065 -0.313662 0.027350 -0.658738 0.002631 -0.308312 -0.436451 -0.314030 0.028162 0.269390 0.226805 0.233258 0.230554 0.228245 0.277483 0.268302 0.227084 0.232793 0.230872 0.228085 0.275677
charge: -0.439062 0.592834 -0.191302 -0.081315 -0.176514 -0.231011 -0.179468 -0.067302 -0.192549 -0.081240 -0.176833 -0.230829 -0.179828 -0.067102 0.146303 0.140589 0.132800 0.133722 0.141608 0.156527 0.145777 0.140697 0.132563 0.133724 0.141589 0.155623
qa: -0.6065 1.0506 -0.6577 0.0024 -0.3073 -0.4371 -0.3137 0.0274 -0.6587 0.0026 -0.3083 -0.4365 -0.3140 0.0282 0.2694 0.2268 0.2333 0.2306 0.2282 0.2775 0.2683 0.2271 0.2328 0.2309 0.2281 0.2757
va: 2.1368 4.2105 3.1379 3.7164 3.8186 3.7122 3.8103 3.6834 3.1370 3.7175 3.8195 3.7124 3.8119 3.6864 0.8846 0.9201 0.8889 0.8933 0.9194 0.8902 0.8854 0.9200 0.8891 0.8929 0.9194 0.8903
dispersion: -0.017487188 hartree
energy: -860.893436060152 hartree
dipole: -0.55072 0.45516 -0.09555 8.59758 -7.06328 1.53431 3.68973 -3.03341 0.65632
magnitude: 1.67152 au
magnitude: 4.24866 debye
temp: 298.15 k
press: 1.00 atm
zeropoint: 0.21457069 hartree
thermalvibcorrection: 0.00979578 hartree
thermalrotcorrection: 0.00141627 hartree
thermaltrasncorrection: 0.00141627 hartree
thermaltotal: -860.66623705 hartree
thermalcorr: 0.01262833 hartree
nonthermalcorr: 0.21457069 hartree
totalcorr: 0.22719901 hartree
thermalcorrenthalpy: 0.00094421 hartree
totalenthalpy: -860.66529284 hartree
vibrat: 0.01703865 hartree
rotat: 0.01522099 hartree
transl: 0.01988309 hartree
total: 0.05214272 hartree
totalentropycorr: -0.05214272 hartree
gibbsenthalpy: -860.71743556 hartree
gibbsminuselec: 0.17600050 hartree
