program: Orca
programVersion: 5.0.4
elementType: N C C C C C Si N C C C C C H H H H H H H H H H H H
charge: 2
multiplicity: 1
keywords: SP DSD-BLYP D3BJ def2-QZVPP def2-QZVPP/C def2/J TightSCF
formula: C10H12N2Si
InChI: InChI=1/C10H12N2Si/c1-3-7-11(8-4-1)13-12-9-5-2-6-10-12/h3-10H,1-2H2
25 atoms
N  1.38545 -0.383548 0.142036
C  1.495566 0.741763 -0.648838
C  2.664652 1.405797 -0.795472
C  3.896016 0.960044 -0.133188
C  3.716964 -0.249284 0.676011
C  2.515688 -0.864947 0.772721
Si -0.001689 -1.578954 0.121471
N  -1.387911 -0.399523 -0.07653
C  -2.513006 -0.961568 -0.64555
C  -3.712091 -0.333933 -0.649823
C  -3.892662 0.977813 -0.020544
C  -2.666205 1.508962 0.584609
C  -1.499151 0.82665 0.546585
H  0.607422 1.057614 -1.176453
H  2.689776 2.285646 -1.425253
H  4.321519 1.776082 0.480161
H  4.704456 0.813184 -0.873522
H  4.559335 -0.660091 1.217334
H  2.395434 -1.763236 1.366505
H  -2.390656 -1.934691 -1.106066
H  -4.550854 -0.813152 -1.137792
H  -4.309623 1.700611 -0.746163
H  -4.707549 0.937489 0.726206
H  -2.692602 2.469493 1.08259
H  -0.614154 1.2103 1.033018
totalener: -784.87472940 hartree
nucrepener: 821.85127832 hartree
electener: -1606.72600772 hartree
oneelecener: -2672.64302531 hartree
twoeener: 1065.91701758 hartree
kineticenergy: 783.27991617 hartree
exchangeener: -27.703194340606 hartree
correlationener: -1.835480059643 hartree
xcener: -29.538674400249 hartree
chargesum: 2.0000000
charge: -0.359075 0.105713 -0.036658 0.004182 -0.033175 0.112193 0.589360 -0.358886 0.114406 -0.034428 0.004273 -0.033032 0.102731 0.134696 0.168918 0.139860 0.143032 0.175874 0.148162 0.148514 0.176291 0.139373 0.142442 0.168144 0.137089
charge: 0.368943 -0.011269 0.198647 0.137676 0.206707 -0.010123 0.368738 0.368984 -0.009928 0.207164 0.137729 0.198733 -0.010917 -0.043909 -0.021114 0.021013 0.021380 -0.018231 -0.035040 -0.034893 -0.018207 0.020950 0.021614 -0.021049 -0.043596
qa: -0.3591 0.1057 -0.0367 0.0042 -0.0332 0.1122 0.5894 -0.3589 0.1144 -0.0344 0.0043 -0.0330 0.1027 0.1347 0.1689 0.1399 0.1430 0.1759 0.1482 0.1485 0.1763 0.1394 0.1424 0.1681 0.1371
va: 3.3471 3.7227 3.8031 3.8621 3.7972 3.7487 2.2354 3.3513 3.7488 3.7979 3.8630 3.8039 3.7243 0.9886 0.9718 0.9838 0.9811 0.9688 0.9858 0.9856 0.9689 0.9841 0.9817 0.9723 0.9888
total: -785.996197599 hartree
dispersion: -0.021802922 hartree
energy: -786.018000521017 hartree
dipole: 0.01181 -0.01968 -0.00786 6.72716 -5.82342 0.90374 -0.53141 0.45783 -0.07357
magnitude: 0.90677 au
magnitude: 2.30482 debye
