program: Orca
programVersion: 5.0.4
elementType: F Si C C C C C C C C C C C C H H H H H H H H
charge: 1
multiplicity: 1
keywords: Freq RIJCOSX PBEh-3c
frequency: 0.00 0.00 0.00 0.00 0.00 0.00 91.39 98.83 111.08 173.42 217.10 253.32 321.27 378.60 421.32 424.06 430.11 474.38 495.29 505.91 563.99 635.55 714.80 745.91 766.87 773.13 779.70 807.86 823.76 941.99 942.40 1031.30 1031.84 1033.04 1042.91 1074.93 1076.98 1086.82 1096.74 1116.48 1127.20 1202.79 1208.89 1227.16 1240.45 1283.17 1349.85 1356.89 1379.48 1423.45 1513.90 1524.64 1545.83 1558.59 1674.13 1683.85 1696.76 1701.65 3282.53 3284.91 3287.56 3289.32 3295.48 3298.27 3307.63 3308.64
frequency: 91.39 98.83 111.08 173.42 217.10 253.32 321.27 378.60 421.32 424.06 430.11 474.38 495.29 505.91 563.99 635.55 714.80 745.91 766.87 773.13 779.70 807.86 823.76 941.99 942.40 1031.30 1031.84 1033.04 1042.91 1074.93 1076.98 1086.82 1096.74 1116.48 1127.20 1202.79 1208.89 1227.16 1240.45 1283.17 1349.85 1356.89 1379.48 1423.45 1513.90 1524.64 1545.83 1558.59 1674.13 1683.85 1696.76 1701.65 3282.53 3284.91 3287.56 3289.32 3295.48 3298.27 3307.63 3308.64
formula: C12H8FSi
InChI: InChI=1/C12H8FSi/c13-14-11-7-3-1-5-9(11)10-6-2-4-8-12(10)14/h1-8H
22 atoms
F  0.607679 3.176354 -1.838146
Si 0.344086 1.861398 -1.02221
C  1.513101 0.61511 -0.526256
C  0.688739 -0.365579 0.076868
C  1.283965 -1.517563 0.550259
C  2.664369 -1.67827 0.43475
C  3.466398 -0.705154 -0.145499
C  2.889034 0.454194 -0.637414
C  -0.770532 -0.058274 0.143692
C  -1.184582 1.179881 -0.408172
C  -2.515354 1.582182 -0.390253
C  -3.459961 0.742533 0.178999
C  -3.064186 -0.477266 0.710149
C  -1.730284 -0.882259 0.697027
H  0.700166 -2.302592 1.011188
H  3.118642 -2.585563 0.809424
H  4.534484 -0.85287 -0.216428
H  3.501777 1.218157 -1.096861
H  -2.814294 2.53342 -0.809619
H  -4.50018 1.034284 0.207447
H  -3.806234 -1.132007 1.147019
H  -1.466833 -1.840117 1.124036
totalener: -849.66579804 hartree
nucrepener: 894.43830011 hartree
electener: -1744.10409815 hartree
oneelecener: -2922.08828106 hartree
twoeener: 1177.98418291 hartree
kineticenergy: 844.82792229 hartree
exchangeener: -53.236841442215 hartree
correlationener: -4.581504697572 hartree
xcener: -57.818346139787 hartree
energy: -1823.7003 -688.6144 -289.5866 -289.5725 -289.1712 -289.1496 -289.1426 -289.1206 -288.8448 -288.8405 -288.7462 -288.7423 -288.5237 -288.5156 -157.4173 -111.0387 -110.9182 -110.8047 -41.4275 -31.3430 -30.3638 -28.5079 -27.6586 -27.1955 -26.5964 -24.1853 -23.6665 -22.5626 -22.1939 -21.9038 -20.7544 -19.7934 -19.5122 -19.3156 -19.3122 -18.8720 -18.0562 -17.9060 -17.8077 -17.4739 -16.9905 -16.8471 -15.7353 -15.6757 -15.5644 -15.2414 -14.3881 -13.4801 -13.0548 -12.4649 -11.6139 -6.9611 -4.6691 -4.4222 -3.9454 -2.9272 -2.6786 -0.9984 -0.7790 0.2505 0.6115 0.8971 0.9411 1.3845 1.5511 1.8380 1.9641 2.9791 3.0603 3.1147 3.4310 3.9265 4.2215 4.6663 4.8588 5.5089 5.9896 6.7858 6.9246 6.9697 7.5218 7.9018 8.9776 9.2236 10.0151 10.1648 10.3611 10.5779 10.8178 11.2878 11.3829 11.7859 11.9959 12.3073 12.5064 12.8012 12.8630 12.9077 13.2157 13.2582 13.8607 14.1590 14.2044 14.3833 14.6669 14.9273 15.3670 15.4686 15.9009 16.0422 17.0436 17.2946 17.3532 18.3969 18.6685 19.7615 20.3365 21.0985 21.8989 22.3410 22.3829 22.6035 23.1761 23.4232 23.4793 23.6775 24.1604 24.2832 24.4724 25.0583 25.1114 25.3632 25.6163 26.6621 27.2334 27.4407 28.3485 28.5119 28.9792 29.1677 29.6269 29.9073 30.4085 30.7567 31.2061 31.7602 31.8838 32.3761 32.6134 32.6306 33.8351 35.8147 35.8836 36.0718 36.8292 37.4794 37.5615 37.7750 37.9103 38.0711 38.8934 39.0556 40.3825 40.8454 42.2982 42.8054 44.2140 45.1861 45.6190 45.7096 46.7815 47.7284 49.5576 50.4362 50.5923 51.6086 52.0346 53.4420 53.9843 54.7173 54.8261 54.9531 55.2299 55.5263 55.8745 57.1943 57.6707 57.7225 58.5548 59.4049 59.8330 60.3989 60.6157 60.8716 63.5683 64.7644 66.2434 67.3180 67.9423 69.1669 69.2249 69.6562 70.6335 70.8214 70.9167 72.0232 72.7533 72.8723 73.7025 74.4797 77.2770 77.7508 79.5456 85.2970 88.0505 91.6677 355.7731 359.6938 366.3788 368.7660 369.1068 373.5348 379.1796 380.3105 380.7140 382.2895 391.1028 391.3764 887.8934 electronvolt
chargesum: 1.0000000
charge: -0.385270 1.283767 -0.241382 0.122833 -0.299511 -0.183902 -0.213395 -0.228545 0.118499 -0.241612 -0.229306 -0.212887 -0.183376 -0.298642 0.252657 0.285304 0.281172 0.277000 0.277111 0.281253 0.285418 0.252813
charge: -0.157015 0.936602 -0.219653 -0.002618 -0.101622 -0.052928 -0.109132 -0.059174 -0.002341 -0.219489 -0.059476 -0.109223 -0.052872 -0.101600 0.158353 0.166436 0.165677 0.164633 0.164712 0.165750 0.166498 0.158483
qa: -0.3853 1.2838 -0.2414 0.1228 -0.2995 -0.1839 -0.2134 -0.2285 0.1185 -0.2416 -0.2293 -0.2129 -0.1834 -0.2986 0.2527 0.2853 0.2812 0.2770 0.2771 0.2813 0.2854 0.2528
va: 1.1093 3.4365 3.6883 3.6848 3.7448 3.7727 3.7864 3.7355 3.6889 3.6873 3.7349 3.7867 3.7719 3.7452 0.9067 0.8849 0.8878 0.8904 0.8906 0.8878 0.8848 0.9067
dispersion: -0.015816645 hartree
energy: -849.655099671154 hartree
dipole: -1.85356 1.80818 -0.04538 -9.85331 9.70094 -0.15237 5.54474 -5.42971 0.11503
magnitude: 0.19624 au
magnitude: 0.49880 debye
temp: 298.15 k
press: 1.00 atm
zeropoint: 0.16980575 hartree
thermalvibcorrection: 0.00753297 hartree
thermalrotcorrection: 0.00141627 hartree
thermaltrasncorrection: 0.00141627 hartree
thermaltotal: -849.47492841 hartree
thermalcorr: 0.01036551 hartree
nonthermalcorr: 0.16980575 hartree
totalcorr: 0.18017126 hartree
thermalcorrenthalpy: 0.00094421 hartree
totalenthalpy: -849.47398420 hartree
vibrat: 0.01252467 hartree
rotat: 0.01507647 hartree
transl: 0.01984782 hartree
total: 0.04744896 hartree
totalentropycorr: -0.04744896 hartree
gibbsenthalpy: -849.52143317 hartree
gibbsminuselec: 0.13366650 hartree
